{"text_format":"1","workbook":"xlsx","n_sheets":10,"sheets":["Übersicht","VUÜ-Budget","VUÜ-SK","VUÜ-PP","VUÜ-PV","Rechenblatt","Parameter","Stundentafel","Schuldatei","DBFH"],"not_rendered":{"charts":0,"images":0,"macros":1,"external_links":0,"defined_names":25,"comments":3,"pivot_tables":0},"unopened":[],"bounds":{"document_bytes":16777216,"sheet_cells":100000,"rows_first":2000,"rows_last":500,"rows_between":2000,"halvings":0,"cell_chars":16384,"cell_head_chars":4096},"cells_cut":0,"cells_raw":0,"read":"whole","date_system":"1900"}

{"sheet":"Übersicht","index":0,"n_rows":37,"n_cols":10,"rows_kept":37,"cut":false,"hidden":false,"merged":[[42,1,42,6],[43,1,43,6],[0,3,3,3],[23,1,23,6],[10,0,10,6],[15,0,15,6],[16,0,16,6],[6,0,6,6],[11,0,11,6],[22,1,22,6],[21,1,21,4],[17,1,17,6],[20,1,20,6],[24,1,24,6],[25,1,25,6],[40,1,40,6],[41,1,41,6],[34,1,34,6],[28,1,28,6],[26,1,26,6],[29,1,29,6],[33,1,33,6],[32,1,32,6],[31,1,31,6],[30,1,30,6],[35,1,35,6],[36,1,36,6],[39,1,39,6]]}
["Bayerisches Staatsministerium"]
["für Unterricht und Kultus"]
["Referat VI.6",null,null,null,null,"SchulNr. FOS"]
["80333 München",null,null,null,null,"SchulNr. BOS"]
[null,null,null,"Name und Anschrift der Schule"]
[]
["! Übermittlung der Daten nur in elektronischer Form !"]
[]
[]
[]
{"$rows_left_out":28}
{"sheet":"VUÜ-Budget","index":1,"n_rows":112,"n_cols":14,"rows_kept":112,"cut":false,"hidden":false,"merged":[[105,0,110,0],[1,8,1,9],[35,1,35,7],[35,8,35,9],[44,1,44,7],[44,8,44,9]]}
["Unterrichtsbudget an Fachoberschulen und Berufsoberschulen"]
["Budgetierung der beruflichen Oberschule für das Schuljahr",null,null,null,null,null,null,null,{"$f":"schuljahr","v":"2023/24"}]
[null,null,null,null,"FOS","BOS"]
["Standort:",null,null,null,{"$f":"Übersicht!G3","v":0},{"$f":"Übersicht!G4","v":0}]
[]
["Budgetrelevante Schülerzahlen (gemäß VUÜ-SK)",null,null,null,null,null,null,null,null,null,null,null,"Schüler"]
["FOS","T","W","S","G","A","IW","GP","insg",null,"DBFH",null,"T","W"]
["Vorkurs",{"$f":"Rechenblatt!M7:S11","v":0},0,0,0,0,0,0,{"$f":"Rechenblatt!T7:T8","v":0},null,"1. Abschnitt",null,{"$f":"'VUÜ-SK'!F36:G39","v":0},0]
["Vorklasse",0,0,0,0,0,0,0,0,null,"2. Abschnitt",null,0,0]
["FOS 11",0,0,0,0,0,0,0,{"$f":"SUM(B10:H10)","v":0},null,"Abschnitt 13/1",null,0,0]
{"$rows_left_out":103}
{"sheet":"VUÜ-SK","index":2,"n_rows":80,"n_cols":40,"rows_kept":80,"cut":false,"hidden":false,"merged":[[4,29,5,29],[41,29,42,29],[19,1,20,1],[19,2,20,2],[63,1,64,1],[63,2,64,2],[54,1,55,1],[54,2,55,2],[60,1,61,1],[60,2,61,2],[27,1,29,1],[24,1,26,1],[41,13,41,20],[41,21,41,28],[22,5,22,12],[4,5,4,12],[2,1,2,2],[4,13,4,20],[4,21,4,28],[33,5,33,6],[41,4,41,6],[41,7,41,11]]}
[null,{"$f":"\"Schüler- und Klassenzahlen (VUÜ-SK)  im Schuljahr \"&schuljahr","v":"Schüler- und Klassenzahlen (VUÜ-SK)  im Schuljahr 2023/24"}]
[]
[null,"Eingabefelder"]
[null,"1. Fachoberschule:"]
[null,"Schulnummer",null,{"$f":"IF(Übersicht!G3=\"\",\"\",Übersicht!G3)","v":""},"Vor-","FOS 11",null,null,null,null,null,null,null,"FOS 12",null,null,null,null,null,null,null,"FOS 13",null,null,null,null,null,null,null,"FOS"]
[null,"1.1 Schülerzahlen für Klassenbildung FOS",null,null,"klasse","T","W","S","G","A","IW","GP","FOS11","T","W","S","G","A","IW","GP","FOS12","T","W","S","G","A","IW","GP","FOS13"]
[null,"Z1","Gesamtzahl Neuanmeldungen (Schnitt erreicht)1) ",null,null,null,null,null,null,null,null,null,{"$f":"SUM(F7:L7)","v":0},null,null,null,null,null,null,null,{"$f":"SUM(N7:T7)","v":0},null,null,null,null,null,null,null,{"$f":"SUM(V7:AB7)","v":0},{"$f":"SUM(E7,M7,U7,AC7)","v":0}]
[null,"Z2","voraussichtliche Wiederholungsschüler",null,null,null,null,null,null,null,null,null,{"$f":"SUM(F8:L8)","v":0},null,null,null,null,null,null,null,{"$f":"SUM(N8:T8)","v":0},null,null,null,null,null,null,null,{"$f":"SUM(V8:AB8)","v":0},{"$f":"SUM(E8,M8,U8,AC8)","v":0}]
[null,"Z3","voraussichtliche Aufsteiger",null,null,null,null,null,null,null,null,null,{"$f":"SUM(F9:L9)","v":0},null,null,null,null,null,null,null,{"$f":"SUM(N9:T9)","v":0},null,null,null,null,null,null,null,{"$f":"SUM(V9:AB9)","v":0},{"$f":"SUM(E9,M9,U9,AC9)","v":0}]
[null,"Z4","Summe (Z1+Z2+Z3)",null,{"$f":"SUM(E7:E9)","v":0},{"$f":"SUM(F7:F9)","v":0},0,0,0,0,0,0,0,0,0,0,0,0,0,0,0,0,0,0,0,0,0,0,0,0]
{"$rows_left_out":71}
{"sheet":"VUÜ-PP","index":3,"n_rows":50,"n_cols":19,"rows_kept":50,"cut":false,"hidden":true,"merged":[[3,15,6,18],[32,17,32,18],[33,17,33,18],[8,16,15,16],[21,17,21,18],[8,17,15,18],[16,17,16,18],[0,0,1,1],[26,17,26,18],[22,17,22,18],[8,15,15,15],[18,17,18,18],[25,17,25,18],[23,17,23,18],[24,17,24,18],[19,17,19,18],[20,17,20,18],[17,17,17,18],[8,6,15,6],[8,14,15,14],[8,13,15,13],[8,12,15,12],[8,10,15,10],[8,7,15,7],[8,8,15,8],[8,11,15,11],[8,9,15,9],[16,5,20,5],[30,5,40,5],[21,5,29,5],[42,17,42,18],[40,17,40,18],[41,17,41,18],[36,17,36,18],[37,17,37,18],[38,17,38,18],[39,17,39,18],[30,3,31,3],[34,3,35,3],[27,0,28,1],[35,17,35,18],[27,17,27,18],[28,17,28,18],[34,17,34,18],[29,17,29,18],[30,17,30,18],[31,17,31,18],[30,0,31,0],[30,1,31,1],[30,2,31,2],[34,0,35,0],[34,1,35,1],[34,2,35,2]]}
["UPZ + AZK",null,null,null,null,"Personalplanung für das Schuljahr 2020/21 (VUÜ-PP)",null,null,null,null,null,null,null,null,null,null,null,{"$f":"IF(Übersicht!G3<>\"\",Übersicht!G3,\"\")","v":""},"SchNr. FOS"]
[null,null,null,null,null,null,null,null,null,null,null,null,null,null,null,null,null,{"$f":"IF(Übersicht!G4<>\"\",Übersicht!G4,\"\")","v":""},"SchNr. BOS"]
[]
[null,null,null,null,null,null,null,null,null,null,null,null,null,null,null,{"$f":"IF(Übersicht!D1<>\"\",Übersicht!D1,\"\")","v":""}]
[]
["A) Bedarfsberechnung",null,null,null,null,null,"B) Personalmaßnahmen "]
[null,null,null,null,null,null,"(Deckung von Bedarf, Abbau von Überhängen)"]
["a) Berechnung Gesamtbudget"]
["Unterrichtsbudget einschl. FPA",null,null,{"$f":"'VUÜ-Budget'!J112","v":0},null,null,"Art der Maßnahme (Ref,N,V+,V-,R,E,AV,AO,nb)","Fächerverbindung","Name","Ref. Stellen","Ref. Stunden","N,V+,V-,E,R (Stellen)","N,V+,V-,E,R (Std)","AO Stunden","AV Stellen","AV Stunden","nb Stunden","Bemerkungen"]
["darunter FPA 4. QE (fpV, fpAn, fpB)",null,null,{"$f":"'VUÜ-Budget'!J101","v":0}]
{"$rows_left_out":41}
{"sheet":"VUÜ-PV","index":4,"n_rows":84,"n_cols":8,"rows_kept":84,"cut":false,"hidden":true,"merged":[[48,5,48,7],[3,0,4,1],[22,1,23,1],[37,1,42,1],[46,5,46,7],[47,5,47,7],[3,7,4,7],[43,5,43,7],[9,1,14,1],[3,6,4,6],[3,2,4,2],[3,3,4,3],[3,4,4,4],[3,5,4,5],[22,0,23,0],[31,1,36,1],[56,5,56,7],[59,5,59,7],[50,5,50,7],[51,5,51,7],[49,5,49,7],[78,5,78,7],[79,5,79,7],[69,5,69,7],[73,5,73,7],[74,5,74,7],[76,5,76,7],[70,5,70,7],[71,5,71,7],[72,5,72,7],[75,0,79,0],[6,1,8,1],[6,0,8,0],[9,0,14,0],[15,1,21,1],[75,1,79,1],[15,0,21,0],[28,1,30,1],[59,1,60,1],[59,0,60,0],[45,1,47,1],[54,1,57,1],[54,0,57,0],[45,0,47,0],[31,0,36,0],[51,1,53,1],[51,0,53,0],[48,1,50,1],[66,1,68,1],[69,1,74,1],[69,0,74,0],[66,0,68,0],[61,1,62,1],[61,0,62,0],[25,1,27,1],[28,0,30,0],[25,0,27,0],[37,0,41,0],[48,0,50,0],[43,0,43,1],[44,5,44,7],[45,5,45,7],[62,5,62,7],[75,5,75,7],[67,5,67,7],[68,5,68,7],[63,5,63,7],[66,5,66,7],[61,5,61,7],[52,5,52,7],[53,5,53,7],[54,5,54,7],[55,5,55,7],[60,5,60,7],[58,5,58,7],[57,5,57,7],[86,5,86,7],[63,0,65,0],[63,1,65,1],[64,5,64,7],[65,5,65,7],[80,0,82,0],[80,1,82,1],[80,5,80,7],[81,5,81,7],[77,5,77,7],[82,5,82,7],[83,5,83,7],[84,5,84,7],[83,1,84,1],[83,0,84,0],[85,5,85,7]]}
["Personalveränderungen zum Schuljahr 2019/20 (VUÜ-PV)",null,null,null,null,null,{"$f":"IF(Übersicht!G3<>\"\",Übersicht!G3,\"\")","v":""},"SchNr. FOS"]
["Stand: 09.03.2019",null,null,null,null,null,{"$f":"IF(Übersicht!G4<>\"\",Übersicht!G4,\"\")","v":""},"SchNr. BOS"]
[]
["Personalveränderungen\n(seit 20.10.2018)",null,"Lehrkraft","Fächer"," Stunden-änderung ","Grund","vorauss.   Dauer bis","Stellungnahme d. Schulleitung"]
[]
[1,"Abgänge"]
["1.1","Pensionierung, Krankheit, Tod"]
[]
[]
["1.2","Beurlaub., Muttersch., Elternzeit Anzugeben sind alle Lehrkräfte, deren Berulaubung fortbesteht oder neu beantragt wurde."]
{"$rows_left_out":75}
{"sheet":"Rechenblatt","index":5,"n_rows":151,"n_cols":153,"rows_kept":151,"cut":false,"hidden":true,"merged":[[108,7,108,12],[108,15,108,20],[75,2,75,3],[75,4,75,5],[75,6,75,7],[75,8,75,9]]}
["Bedarfsberechnung für die Schule"]
[null,null,null,null,"FOS","BOS"]
["Standort:",null,{"$f":"Übersicht!#REF!","v":{"$error":"#REF!"}},null,{"$f":"Übersicht!G3","v":0},{"$f":"Übersicht!G4","v":0}]
[null,null,null,null,null,null,null,null,null,null,null,"Mit Mindestschülerzahlen"]
["Voraussichtliche Schülerzahlen (nach VUÜ-SK)",null,null,null,null,null,null,null,null,null,null,"Anwendung der Mindestschülerzahlen"]
["FOS","T","W","S","G","A","IW","GP","insg",null,null,"FOS","T","W","S","G","A","IW","GP","insg",null,null,null,null,null,null,null,null,"Mindestschülerzahlalgorithmus (VK-12)"]
["Vorkurs",null,null,null,null,null,null,null,{"$f":"'VUÜ-SK'!E20","v":0},null,null,"Vorkurs",null,null,null,null,null,null,null,{"$f":"IF(I7<Parameter!J39,0,I7)","v":0},{"$f":"Parameter!J39","v":0},"Mindestschülerzahl 12",null,null,null,null,null,null,"Sofern (insgesamt) unter 2*8 = 16 > KEINE Budgetschüler"]
["Vorklasse",null,null,null,null,null,null,null,{"$f":"'VUÜ-SK'!E14","v":0},null,null,"Vorklasse",null,null,null,null,null,null,null,{"$f":"IF(I8<Parameter!K39,0,I8)","v":0},{"$f":"Parameter!K39","v":0},"Mindestschülerzahl 15",null,null,null,null,null,null,"Solange noch eine ABR < 8"]
["FOS 11",{"$f":"'VUÜ-SK'!F14","v":0},{"$f":"'VUÜ-SK'!G14","v":0},{"$f":"'VUÜ-SK'!H14","v":0},{"$f":"'VUÜ-SK'!I14","v":0},{"$f":"'VUÜ-SK'!J14","v":0},{"$f":"'VUÜ-SK'!K14","v":0},{"$f":"'VUÜ-SK'!L14","v":0},{"$f":"SUM(B9:H9)","v":0},null,null,"FOS 11",{"$f":"B9:H11","v":0},0,0,0,0,0,0,{"$f":"SUM(M9:S9)","v":0},"Mindestschülerzahlalgorithmus (je Abr 8, insgesamt mind. 2x8)",null,null,null,null,null,null,null,null,"nulle die/eine kleinste ABR aus"]
["FOS 12",{"$f":"'VUÜ-SK'!N14","v":0},{"$f":"'VUÜ-SK'!O14","v":0},{"$f":"'VUÜ-SK'!P14","v":0},{"$f":"'VUÜ-SK'!Q14","v":0},{"$f":"'VUÜ-SK'!R14","v":0},{"$f":"'VUÜ-SK'!S14","v":0},{"$f":"'VUÜ-SK'!T14","v":0},{"$f":"SUM(B10:H10)","v":0},null,null,"FOS 12",0,0,0,0,0,0,0,{"$f":"SUM(M10:S10)","v":0},"Mindestschülerzahlalgorithmus (je Abr 8, insgesamt mind. 2x8)",null,null,null,null,null,null,null,null,"verteile diese Schüler proportional nach SZ auf die anderen ABR"]
{"$rows_left_out":142}
{"sheet":"Parameter","index":6,"n_rows":89,"n_cols":28,"rows_kept":89,"cut":false,"hidden":true,"merged":[[11,6,12,6],[11,7,12,7],[9,6,10,6],[9,7,10,7],[0,6,0,7],[3,14,3,17],[4,6,4,7],[7,6,8,6],[7,7,8,7],[5,6,6,6],[5,7,6,7],[69,8,69,9],[69,10,69,11],[13,6,14,6],[13,7,14,7],[17,6,18,6],[23,7,24,7],[27,7,28,7]]}
["Zentrale Parametersetzungen",null,null,null,null,null,"Modell",null,"Schulart","Vorklasse","Vorkurs",11,12,13,null,null,null,null,null,null,null,null,"Standardquote für Religionsunterricht"]
[null,null,null,null,null,null,"Schuljahr","2023/24","Vorjahr",{"$f":"LEFT(schuljahr,4)-1&\"/\"&TEXT(RIGHT(schuljahr,2)-1,\"00\")","v":"2022/23"},null,null,null,null,null,null,null,null,null,null,null,null,"als Ersatzwerte, falls keine schulbezogenen Werte ermittelbar"]
[null,null,null,null,null,null,"Auswahl des Modells",null,"Klassenteiler"]
["tiefe",2,null,null,null,null,"Modell 1",null,null,null,null,null,null,null,"Reli/Ethik, Sport, Ku/Mu",null,null,null,null,null,null,null,"Auswertung ASD 2016/17 (Bayern) - Jgst VS-12-13"]
["symmetrie",8,null,null,null,null,"Modell",null,"Schulart","Vorklasse","Vorkurs","11","12","13","NF_VS","NF_11","NF_12","NF_13","Seminar",null,null,null,"FOS","rk","ev","sonst","Ethik"]
[null,null,null,null,null,null,"Mod 1","Standardmodell","FOS",30,32,28,25,25,28,{"$f":"$O$6","v":28},28,28,15,null,null,null,"absolut",9936,4389,2,7189,{"$f":"SUM(X6:AA6)","v":21516}]
[null,null,null,null,null,null,null,null,"BOS",30,32,"x",25,25,{"$f":"$O$6","v":28},28,28,28,15,null,null,null,"relativ",{"$f":"X6/$AB$6","v":0.46179587283881762},{"$f":"Y6/$AB$6","v":0.20398773006134968},{"$f":"Z6/$AB$6","v":9.295408068414203E-5},{"$f":"AA6/$AB$6","v":0.33412344301914854},{"$f":"AB6/$AB$6","v":1}]
[null,null,null,null,null,null,"Mod 2","Ungünstiger-Modell","FOS",32,32,28,28,25,28,{"$f":"$O$8","v":28},28,28,15]
[null,null,null,null,null,null,null,null,"BOS",32,32,"x",28,25,{"$f":"$O$8","v":28},28,28,28,15,null,null,null,"Auswertung ASD 2016/17 (Bayern) - Jgst VS-12-13"]
["Faktorenmodell",null,null,null,null,null,"Mod 3","Faktorenmodell","FOS",25,30,30,27,24,{"$f":"J10","v":25},{"$f":"L10","v":30},27,24,15,null,null,null,"BOS","rk","ev","sonst","Ethik"]
{"$rows_left_out":80}
{"sheet":"Stundentafel","index":7,"n_rows":148,"n_cols":51,"rows_kept":148,"cut":false,"hidden":true,"merged":[[51,20,51,25],[70,10,70,12],[67,13,67,19],[68,14,68,19],[69,10,69,12],[68,10,68,12],[67,10,67,12]]}
["FOS/BOS",null,"FOS","BOS","Sem","WPF","FöU-FOS11","Teilung","BOS12","fpU","fpA-r","fpA-M","fpV-r","fpV-M","fpB-S","fpB-B","IV-Gru","FSpAbi","WU","Vkl-Zu","D/E/G+Sk","M(T)","M(NT)","T","W","S","G","A","IW","GP","Nat13"]
["Vorklasse",null,{"$f":"33-V55","v":32},{"$f":"33-Y55","v":32},2,2,1,1,2,17,1,2,1,2,{"$f":"3/40","v":7.4999999999999997E-2},{"$f":"3/40","v":7.4999999999999997E-2},36,4,0.04,3,12,5,5,10,8,10,8,10,5,10,2]
["Vorkurs",null,3,6,null,null,null,null,{"$f":"INT((I5-1)/($C$20-1))+1","v":1},{"$f":"INT((J5-1)/($C$20-1))+1","v":1},1,1,1,1,2,2,2,2,2,2,3,3,3,3,3,3,4,4,4,4,4,4,5,5,5,5,5,5,6,6,6,6,6,6,7,7,7,7,7,7]
[null,null,null,null,null,null,null,null,{"$f":"MOD(I5-1,$C$20-1)+1+IF(MOD(I5-1,$C$20-1)+1>=I3,1,0)","v":2},{"$f":"MOD(J5-1,$C$20-1)+1+IF(MOD(J5-1,$C$20-1)+1>=J3,1,0)","v":3},4,5,6,7,1,3,4,5,6,7,1,2,4,5,6,7,1,2,3,5,6,7,1,2,3,4,6,7,1,2,3,4,5,7,1,2,3,4,5,6]
["FOS","T","W","S","G","A","IW","GP",{"$f":"TRANSPOSE(A22:A63)","v":1},2,3,4,5,6,7,8,9,10,11,12,13,14,15,16,17,18,19,20,21,22,23,24,25,26,27,28,29,30,31,32,33,34,35,36,37,38,39,40,41,42]
[11,{"$f":"OFFSET($L$22,I$5+($A6-11)*10,I$5)","v":16},16,16,16,16,14,16,{"$f":"OFFSET($L$22,I$3+($A6-11)*10,I$4)","v":26},26,26,26,24,26,26,23,23,23,{"$f":"OFFSET($L$22,S$3+($A6-11)*10,S$4)","v":19},23,26,23,23,23,21,23,26,23,{"$f":"OFFSET($L$22,AC$3+($A6-11)*10,AC$4)","v":23},23,21,23,26,23,23,23,21,23,{"$f":"OFFSET($L$22,AM$3+($A6-11)*10,AM$4)","v":24},19,21,21,21,21,26,23,23,23,23,21]
[12,26,26,26,26,26,23,26,42,42,42,42,39,42,42,38,36,38,33,38,42,38,38,38,35,38,42,36,38,38,33,38,42,38,38,38,35,38,39,33,35,33,35,35,42,38,38,38,38,35]
[13,27,27,27,27,27,24,27,42,42,42,42,39,42,42,37,35,37,32,37,42,37,37,37,34,37,42,35,37,37,32,37,42,37,37,37,34,37,39,32,34,32,34,34,42,37,37,37,37,34]
["fpA",1,1,1,1,1,1,1,2,{"$f":"I9","v":2},{"$f":"J9","v":2},2,2,2,2,2,2,2,2,2,2,2,2,2,2,2,2,2,2,2,2,2,2,2,2,2,2,2,2,2,2,2,2,2,2,2,2,2,2,2]
["FöU-FO",1,{"$f":"B10","v":1},1,1,1,1,1,1,{"$f":"I10","v":1},{"$f":"J10","v":1},{"$f":"K10","v":1},{"$f":"L10","v":1},{"$f":"M10","v":1},{"$f":"N10","v":1},{"$f":"O10","v":1},{"$f":"P10","v":1},{"$f":"Q10","v":1},{"$f":"R10","v":1},{"$f":"S10","v":1},{"$f":"T10","v":1},{"$f":"U10","v":1},{"$f":"V10","v":1},{"$f":"W10","v":1},{"$f":"X10","v":1},{"$f":"Y10","v":1},{"$f":"Z10","v":1},{"$f":"AA10","v":1},{"$f":"AB10","v":1},{"$f":"AC10","v":1},{"$f":"AD10","v":1},{"$f":"AE10","v":1},{"$f":"AF10","v":1},{"$f":"AG10","v":1},{"$f":"AH10","v":1},{"$f":"AI10","v":1},{"$f":"AJ10","v":1},{"$f":"AK10","v":1},{"$f":"AL10","v":1},{"$f":"AM10","v":1},{"$f":"AN10","v":1},{"$f":"AO10","v":1},{"$f":"AP10","v":1},{"$f":"AQ10","v":1},{"$f":"AR10","v":1},{"$f":"AS10","v":1},{"$f":"AT10","v":1},{"$f":"AU10","v":1},{"$f":"AV10","v":1},{"$f":"AW10","v":1}]
{"$rows_left_out":139}
{"sheet":"Schuldatei","index":8,"n_rows":132,"n_cols":42,"rows_kept":132,"cut":false,"hidden":true,"merged":[]}
["Schuljahr 2017/18",null,null,null,null,null,null,null,null,null,null,null,null,null,null,null,null,null,null,null,null,null,null,null,null,null,null,null,null,null,null,"FOS/BOS Ansbach (0853/0803) und FOS/BOS Triesdorf (0895/0796) in SD als \"4er-Bündel\" unter FFS=0853",null,null,null,null,null,null,null,null,{"$f":"\"Test\"&CHAR(10)&\"Test\"","v":"Test\nTest"}]
["Berufsoberschule",null,null,null,null,null,null,null,null,null,null,"Fachoberschule",null,null,null,null,null,null,null,null,null,null,"vereinigte Liste",null,null,null,null,"Liste der Planungseinheiten (SD)",null,null,null,"Liste der Planungseinheiten",null,null,null,"ohne GER in VUÜ",null,"dafür Trennung IN/EI und Trennung AN/TRI"]
[{"$f":"COUNTA(A5:A77)","v":61},null,null,null,null,null,null,null,null,null,null,{"$f":"COUNTA(L5:L77)","v":67},null,null,null,null,null,null,null,null,null,null,{"$f":"COUNTA(W5:W277)","v":128},null,null,null,null,{"$f":"COUNTA(AB5:AB277)","v":69},null,null,null,{"$f":"COUNTA(AF5:AF277)","v":70},"+1 wg. TRD/ANS","IN/EI aber zusammen!",{"$f":"SUM(AI5:AI113)","v":67},{"$f":"SUM(AJ5:AJ113)","v":61}]
["Schulnummer","Schule","Strasse","Stadt","Träger_Eder","Schulart12","Inaktiv","ERR","FFS","SNR*",null,"Schulnummer","Schule","Strasse","Stadt","Träger_Eder","Schulart12","Inaktiv","ERR","FFS","SNR*",null,"Schulnummer","FFS","SNR*","Schulart",null,"SNR*","FOS","BOS","Typ","SNR*","Kürzel",null,"FOS","BOS","FOS",null,"BOS"]
["0845","Staatliche Berufsoberschule Augsburg ","Alter Postweg 86 a","86159 Augsburg","1-staatlich","51","0","199708","0855",{"$f":"IF(I5=\" \",A5,I5)","v":"0855"},null,"0851","Staatl. Fachoberschule Altötting ","Neuöttinger Str. 64 c","84503 Altötting","1-staatlich","52","0"," "," ",{"$f":"IF(T5=\" \",L5,T5)","v":"0851"},null,"0828","0865","0865",{"$f":"IF(COUNTIF($A$5:$A$113,W5)=1,\"BOS\",\"FOS\")","v":"BOS"},null,"0837",0,1,{"$f":"IF(AI5&AJ5=\"10\",\"FOS\",IF(AI5&AJ5=\"01\",\"BOS\",\"FOBOS\"))","v":"BOS"},"0837","N-BOS","Nürnberg-BOS",{"$f":"SUMPRODUCT(($Y$5:$Y$149=$AF5)*($Z$5:$Z$149=\"FOS\"))","v":0},{"$f":"SUMPRODUCT(($Y$5:$Y$149=$AF5)*($Z$5:$Z$149=\"BOS\"))","v":1},{"$f":"IF(AI5=0,\"-\",INDEX($L$5:$L$100,MATCH($AF5,$U$5:$U$100,0)))","v":"-"},{"$f":"IF(AI5=0,\"-\",INDEX($M$5:$M$100,MATCH($AF5,$U$5:$U$100,0)))","v":"-"},{"$f":"IF(AJ5=0,\"-\",INDEX($A$5:$A$100,MATCH($AF5,$J$5:$J$100,0)))","v":"0837"},{"$f":"IF(AJ5=0,\"-\",INDEX($B$5:$B$100,MATCH($AF5,$J$5:$J$100,0)))","v":"Staatliche Berufsoberschule Nürnberg "},{"$f":"IF(AE5=\"FOS\",AL5&\"\n\"&VLOOKUP(AK5,$L$4:$O$100,3,FALSE)&\"\n\"&VLOOKUP(AK5,$L$4:$O$100,4,FALSE),IF(AE5=\"BOS\",AN5&\"\n\"&VLOOKUP(AM5,$A$4:$O$100,3,FALSE)&\"\n\"&VLOOKUP(AM5,$A$4:$O$100,4,FALSE),SUBSTITUTE(AL5,\"Fachoberschule\",\"Fachoberschule und Berufsoberschule\")&\"\n\"&VLOOKUP(AK5,$L$4:$O$100,3,FALSE)&\"\n\"&VLOOKUP(AK5,$L$4:$O$100,4,FALSE)))","v":"Staatliche Berufsoberschule Nürnberg \nSchoppershofstr. 80\n90489 Nürnberg"}]
["0846","Gustav-von-Schlör-Schule Staatliche Berufsoberschule Weiden i.d.OPf.","Campusallee 2","92637 Weiden i.d.OPf.","1-staatlich","51","0","199708","0896",{"$f":"IF(I6=\" \",A6,I6)","v":"0896"},null,"0852","Staatliche Fachoberschule Amberg ","Raigeringer Str. 27 a","92224 Amberg","1-staatlich","52","0"," ","Z312",{"$f":"IF(T6=\" \",L6,T6)","v":"Z312"},null,"0829","0867","0867",{"$f":"IF(COUNTIF($A$5:$A$113,W6)=1,\"BOS\",\"FOS\")","v":"BOS"},null,"0851",1,1,{"$f":"IF(AI6&AJ6=\"10\",\"FOS\",IF(AI6&AJ6=\"01\",\"BOS\",\"FOBOS\"))","v":"FOBOS"},"0851","AÖ","Altötting",{"$f":"SUMPRODUCT(($Y$5:$Y$149=$AF6)*($Z$5:$Z$149=\"FOS\"))","v":1},{"$f":"SUMPRODUCT(($Y$5:$Y$149=$AF6)*($Z$5:$Z$149=\"BOS\"))","v":1},{"$f":"IF(AI6=0,\"-\",INDEX($L$5:$L$100,MATCH($AF6,$U$5:$U$100,0)))","v":"0851"},{"$f":"IF(AI6=0,\"-\",INDEX($M$5:$M$100,MATCH($AF6,$U$5:$U$100,0)))","v":"Staatl. Fachoberschule Altötting "},{"$f":"IF(AJ6=0,\"-\",INDEX($A$5:$A$100,MATCH($AF6,$J$5:$J$100,0)))","v":"0839"},{"$f":"IF(AJ6=0,\"-\",INDEX($B$5:$B$100,MATCH($AF6,$J$5:$J$100,0)))","v":"Staatliche Berufsoberschule Altötting "},{"$f":"IF(AE6=\"FOS\",AL6&\"\n\"&VLOOKUP(AK6,$L$4:$O$100,3,FALSE)&\"\n\"&VLOOKUP(AK6,$L$4:$O$100,4,FALSE),IF(AE6=\"BOS\",AN6&\"\n\"&VLOOKUP(AM6,$A$4:$O$100,3,FALSE)&\"\n\"&VLOOKUP(AM6,$A$4:$O$100,4,FALSE),SUBSTITUTE(AL6,\"Fachoberschule\",\"Fachoberschule und Berufsoberschule\")&\"\n\"&VLOOKUP(AK6,$L$4:$O$100,3,FALSE)&\"\n\"&VLOOKUP(AK6,$L$4:$O$100,4,FALSE)))","v":"Staatl. Fachoberschule und Berufsoberschule Altötting \nNeuöttinger Str. 64 c\n84503 Altötting"},"Staatliche Fachoberschule und Berufsoberschule Altötting\nNeuöttinger Straße 64 c\n84503 Altötting "]
["0847","Staatliche Berufsoberschule Weilheim i.OB ","Kerschensteinerstr. 2","82362 Weilheim i.OB","1-staatlich","51","0","199708","0897","0897",null,"0853","Staatliche Fachoberschule Ansbach ","Pfarrstr. 21/23","91522 Ansbach","1-staatlich","52","0"," "," ",{"$f":"IF(T7=\" \",L7,T7)&\"A\"","v":"0853A"},null,"0830","Z424","Z424","BOS",null,"0853",2,2,"FOBOS","0853A","AN","Ansbach",1,1,"0853","Staatliche Fachoberschule Ansbach ","0803","Staatliche Berufsoberschule Ansbach ","Staatliche Fachoberschule und Berufsoberschule Ansbach \nPfarrstr. 21/23\n91522 Ansbach","Staatliche Fachoberschule und Berufsoberschule Ansbach \nPfarrstraße 21/23\n91522 Ansbach"]
["0848","Staatliche Berufsoberschule Weißenburg i.Bay. ","Wildbadstr. 19","91781 Weißenburg i.Bay.","1-staatlich","51","0","199708","6091","6091",null,"0854","Staatliche Fachoberschule Aschaffenburg ","Ottostraße 1","63741 Aschaffenburg","1-staatlich","52","0"," "," ","0854",null,"0831","0901","0901","BOS",null,"0854",1,1,"FOBOS","0853T","TRI","Triesdorf",1,1,"0895","Staatliche Fachoberschule Triesdorf in Weidenbach ","0796","Staatliche Berufsoberschule Triesdorf in Weidenbach","Staatliche Fachoberschule und Berufsoberschule Triesdorf in Weidenbach \nReitbahn 7\n91746 Weidenbach","Staatliche Fachoberschule und Berufsoberschule Triesdorf\nReitbahn 7\n91746 Weidenbach "]
["0849","Staatliche Berufsoberschule Bayreuth ","Körnerstr. 6","95448 Bayreuth","1-staatlich","51","0","199708","0859","0859",null,"0855","Staatliche Fachoberschule Augsburg ","Alter Postweg 86 a","86159 Augsburg","1-staatlich","52","0"," "," ","0855",null,"0832","0882","0882","BOS",null,"0855",1,1,"FOBOS","0854","AB","Aschaffenburg",1,1,"0854","Staatliche Fachoberschule Aschaffenburg ","0804","Staatliche Berufsoberschule Aschaffenburg ","Staatliche Fachoberschule und Berufsoberschule Aschaffenburg \nOttostraße 1\n63741 Aschaffenburg","Staatliche Fachoberschule und Berufsoberschule Aschaffenburg\nOttostraße 1\n63741 Aschaffenburg "]
["0850","Adalbert-Raps-Schule Staatliche Berufsoberschule Kulmbach","Georg-Hagen-Str. 35","95326 Kulmbach","1-staatlich","51","0","199708","Z416","Z416",null,"0856","Staatliche Fachoberschule Bad Tölz ","Alter Bahnhofplatz 10","83646 Bad Tölz","1-staatlich","52","0"," "," ","0856",null,"0833","0883","0883","BOS",null,"0856",1,1,"FOBOS","0855","A","Augsburg",1,1,"0855","Staatliche Fachoberschule Augsburg ","0845","Staatliche Berufsoberschule Augsburg ","Staatliche Fachoberschule und Berufsoberschule Augsburg \nAlter Postweg 86 a\n86159 Augsburg","Staatliche Fachoberschule und Berufsoberschule Augsburg\nAlter Postweg 86 a\n86159 Augsburg "]
{"$rows_left_out":123}
{"sheet":"DBFH","index":9,"n_rows":42,"n_cols":23,"rows_kept":42,"cut":false,"hidden":true,"merged":[]}
["Duale Berufsausbildung und Fachhochschulreife",null,null,null,null,null,null,null,null,null,null,null,"ASD 2016/17"]
["DBFH"]
[]
["Stundentafel",null,null,null,null,null,"Stundentafel",null,null,null,null,null,null,null,null,null,{"$f":"SUM(Q6:Q29)","v":254},{"$f":"SUM(R6:R29)","v":268},{"$f":"SUM(S6:S29)","v":299},{"$f":"SUM(T6:T29)","v":2290}]
["Kaufmänn.","Ab 1","Ab 2","Ab 3/1","Ab 3/2",null,"Technisch","Ab 1","Ab 2","Ab 3/1","Ab 3/2",null,"KART","SNR","Schule","BERUFSNR","10","11","12","Schüler",null,"Richtung","SNR-FOS"]
["W","18 Blöcke","18 Blöcke","7 Blöcke","VZ",null,"T","18 Blöcke","18 Blöcke","7 Blöcke","VZ",null,"10","1415","Städt. Berufsschule für Bürokommunikation und Industriekaufleute München"," 78511",18,19,22,{"$f":"SUM(Q6:S6)","v":59},{"$f":"VLOOKUP(P6,#REF!,4,FALSE)","v":{"$error":"#REF!"}},{"$f":"IF(ISERR(FIND(\"aufmann\",U6)),\"T\",\"W\")","v":"T"},{"$f":"VLOOKUP(N6,$N$30:$S$40,6,FALSE)","v":"0805"}]
["Religion",2,2,1,0,null,"Religion",2,2,1,0,null,"10","1569","Staatl. Berufsschule I Ingolstadt "," 26708",null,null,12,{"$f":"SUM(Q7:S7)","v":12},{"$f":"VLOOKUP(P7,#REF!,4,FALSE)","v":{"$error":"#REF!"}},"T","0869"]
["Geschichte",0,2,0,2,null,"Geschichte",0,2,0,2,null,"10","1569","Staatl. Berufsschule I Ingolstadt "," 28149",17,16,14,47,{"$f":"VLOOKUP(P8,#REF!,4,FALSE)","v":{"$error":"#REF!"}},"T","0869"]
["Sozialkunde",2,2,2,0,null,"Sozialkunde",2,2,2,0,null,"10","1569","Staatl. Berufsschule I Ingolstadt "," 31612",null,null,14,14,{"$f":"VLOOKUP(P9,#REF!,4,FALSE)","v":{"$error":"#REF!"}},"T","0869"]
["Deutsch",2,2,3,6,null,"Deutsch",2,2,3,6,null,"10","1574","Städt. Berufsschule für Fertigungstechnik München "," 27823",12,12,12,36,{"$f":"VLOOKUP(P10,#REF!,4,FALSE)","v":{"$error":"#REF!"}},"T","0877"]
{"$rows_left_out":32}