{"text_format":"1","workbook":"xlsx","n_sheets":10,"sheets":["Übersicht","VUÜ-Budget","VUÜ-SK","VUÜ-PP","VUÜ-PV","Rechenblatt","Parameter","Stundentafel","Schuldatei","DBFH"],"not_rendered":{"charts":0,"images":0,"macros":1,"external_links":0,"defined_names":25,"comments":3,"pivot_tables":0},"unopened":[],"bounds":{"document_bytes":16777216,"sheet_cells":100000,"rows_first":2000,"rows_last":500,"rows_between":2000,"halvings":0,"cell_chars":16384,"cell_head_chars":4096},"cells_cut":0,"cells_raw":0,"read":"whole","date_system":"1900"}

{"sheet":"Übersicht","index":0,"n_rows":37,"n_cols":10,"rows_kept":37,"cut":false,"hidden":false,"merged":[[42,1,42,6],[43,1,43,6],[0,3,3,3],[23,1,23,6],[10,0,10,6],[15,0,15,6],[16,0,16,6],[6,0,6,6],[11,0,11,6],[22,1,22,6],[21,1,21,4],[17,1,17,6],[20,1,20,6],[24,1,24,6],[25,1,25,6],[40,1,40,6],[41,1,41,6],[34,1,34,6],[28,1,28,6],[26,1,26,6],[29,1,29,6],[33,1,33,6],[32,1,32,6],[31,1,31,6],[30,1,30,6],[35,1,35,6],[36,1,36,6],[39,1,39,6]]}
["Bayerisches Staatsministerium"]
["für Unterricht und Kultus"]
["Referat VI.6",null,null,null,null,"SchulNr. FOS"]
["80333 München",null,null,null,null,"SchulNr. BOS"]
[null,null,null,"Name und Anschrift der Schule"]
[]
["! Übermittlung der Daten nur in elektronischer Form !"]
[]
[]
[]
["Budgetberechnung für das Schuljahr 2023/2024"]
["(Nichtstaatliche Berufliche Oberschulen)"]
[null,null,null,null,null,null,"Version 2023-01"]
[]
[]
[]
[]
[null,"Auf Richtigkeit und Vollständigkeit überprüft"]
[]
[]
[null,null,null,null,null,null,null,null,true,{"$f":"IF(I21=TRUE,0,1)","v":0}]
[]
[null,"Ort, Datum                           gez. Schulleiterin / Schulleiter",null,null,null,null,null,null,false,{"$f":"IF(I23=TRUE,0,1)","v":1}]
[null,null,null,null,null,null,null,null,false,{"$f":"IF(I24=TRUE,0,1)","v":1}]
[null,null,null,null,null,null,null,null,false,{"$f":"IF(I25=TRUE,0,1)","v":1}]
[null,null,null,null,null,null,null,null,false,{"$f":"IF(I26=TRUE,0,1)","v":1}]
[]
[]
[null,null,null,null,null,null,null,null,false,{"$f":"IF(I29=TRUE,0,1)","v":1}]
[]
[null,null,null,null,null,null,null,null,false,{"$f":"IF(I31=TRUE,0,1)","v":1}]
[]
[null,null,null,null,null,null,null,null,false,{"$f":"IF(I33=TRUE,0,1)","v":1}]
[]
[null,null,null,null,null,null,null,null,false,{"$f":"IF(I35=TRUE,0,1)","v":1}]
[]
[null,null,null,null,null,null,null,null,false,{"$f":"IF(I37=TRUE,0,1)","v":1}]

{"sheet":"VUÜ-Budget","index":1,"n_rows":112,"n_cols":14,"rows_kept":112,"cut":false,"hidden":false,"merged":[[105,0,110,0],[1,8,1,9],[35,1,35,7],[35,8,35,9],[44,1,44,7],[44,8,44,9]]}
["Unterrichtsbudget an Fachoberschulen und Berufsoberschulen"]
["Budgetierung der beruflichen Oberschule für das Schuljahr",null,null,null,null,null,null,null,{"$f":"schuljahr","v":"2023/24"}]
[null,null,null,null,"FOS","BOS"]
["Standort:",null,null,null,{"$f":"Übersicht!G3","v":0},{"$f":"Übersicht!G4","v":0}]
[]
["Budgetrelevante Schülerzahlen (gemäß VUÜ-SK)",null,null,null,null,null,null,null,null,null,null,null,"Schüler"]
["FOS","T","W","S","G","A","IW","GP","insg",null,"DBFH",null,"T","W"]
["Vorkurs",{"$f":"Rechenblatt!M7:S11","v":0},0,0,0,0,0,0,{"$f":"Rechenblatt!T7:T8","v":0},null,"1. Abschnitt",null,{"$f":"'VUÜ-SK'!F36:G39","v":0},0]
["Vorklasse",0,0,0,0,0,0,0,0,null,"2. Abschnitt",null,0,0]
["FOS 11",0,0,0,0,0,0,0,{"$f":"SUM(B10:H10)","v":0},null,"Abschnitt 13/1",null,0,0]
["FOS 12",0,0,0,0,0,0,0,{"$f":"SUM(B11:H11)","v":0},null,"Abschnitt 13/2",null,0,0]
["FOS 13",0,0,0,0,0,0,0,{"$f":"SUM(B12:H12)","v":0}]
["zusammen",{"$f":"SUM(B8:B12)","v":0},0,0,0,0,0,0,0]
[]
["BOS","T","W","S","x","A","IW","GP","insg"]
["Vorkurs",{"$f":"Rechenblatt!M15:S20","v":0},0,0,0,0,0,0,{"$f":"Rechenblatt!T15:T16","v":0}]
["Vorklasse",0,0,0,0,0,0,0,0]
["BOS 12",0,0,0,0,0,0,0,{"$f":"SUM(B18:H18)","v":0}]
["BOS 12/1",0,0,0,0,0,0,0,{"$f":"SUM(B19:H19)","v":0}]
["BOS 12/2",0,0,0,0,0,0,0,0]
["BOS 13",0,0,0,0,0,0,0,{"$f":"SUM(B21:H21)","v":0}]
["zusammen",{"$f":"SUM(B16:B21)","v":0},{"$f":"SUM(C16:C21)","v":0},{"$f":"SUM(D16:D21)","v":0},0,{"$f":"SUM(F16:F21)","v":0},{"$f":"SUM(G16:G21)","v":0},{"$f":"SUM(H16:H21)","v":0},{"$f":"SUM(I16:I21)","v":0}]
[null,null,null,null,null,null,null,"Schüler","Klassen"]
["Integrationsvorklasse (FOS/BOS)",null,null,null,null,null,null,{"$f":"'VUÜ-SK'!E61","v":0},{"$f":"Rechenblatt!D86","v":0}]
[]
[{"$f":"\"Amtliche Schuldaten (\"&vorjahr&\")\"","v":"Amtliche Schuldaten (2022/23)"}]
["Schüler nach Geschlecht",null,null,null,null,"Teilnahme am Religions-/Ethikunterricht (sofern eingerichtet)"]
[null,"männl","weibl","insg",null,null,"rk","ev","son**","eth"]
["FOS 11",{"$f":"'VUÜ-SK'!F75","v":0},{"$f":"'VUÜ-SK'!G75","v":0},{"$f":"SUM(B29:C29)","v":0},null,"FOS 12",{"$f":"'VUÜ-SK'!O75:R78","v":0},0,0,0]
[null,null,null,null,null,"FOS insg*",0,0,0,0]
[null,null,null,null,null,"BOS 12",0,0,0,0]
[null,null,null,null,null,"BOS insg",0,0,0,0]
[null,null,null,null,null,{"$f":"'VUÜ-SK'!J79","v":"* ohne Schüler in Jahrgangsstufe 11, für die kein Religions-/Ethikunterricht vorgesehen ist"}]
[null,null,null,null,null,{"$f":"'VUÜ-SK'!J80","v":"** orthodox, islamischer Unterricht, weiterer Religionsunterricht gem. Art. 46 BayEUG"}]
["Beispiel einer möglichen, aber nicht verbindlichen Klassenbildung (optimierte Mischklassenbildung)"]
[null,"ausbildungsrichtungsreine Klassen",null,null,null,null,null,null,"Mischklassen"]
["FOS","T","W","S","G","A","IW","GP","MKl_1","MKl_2","o. Abr.","Klassen","Stdtfl","Stdtfl*"]
["Vorkurs",null,null,null,null,null,null,null,null,null,{"$f":"Rechenblatt!AL26","v":0},{"$f":"SUM(B38:K38)","v":0},{"$f":"Rechenblatt!AK26","v":0},{"$f":"Rechenblatt!BA26","v":0}]
["Vorklasse",null,null,null,null,null,null,null,null,null,{"$f":"Rechenblatt!AL27","v":0},{"$f":"SUM(B39:K39)","v":0},{"$f":"Rechenblatt!AK27","v":0},{"$f":"Rechenblatt!BA27","v":0}]
["FOS 11",{"$f":"Rechenblatt!AC28:AI30","v":0},0,0,0,0,0,0,{"$f":"VLOOKUP(Rechenblatt!L28,Stundentafel!$A$22:$J$64,10,FALSE)","v":"-"},{"$f":"VLOOKUP(Rechenblatt!M28,Stundentafel!$A$22:$J$64,10,FALSE)","v":"-"},null,{"$f":"Rechenblatt!AL28","v":0},{"$f":"Rechenblatt!AK28","v":0},{"$f":"Rechenblatt!BA28","v":0}]
["FOS 12",0,0,0,0,0,0,0,{"$f":"VLOOKUP(Rechenblatt!L29,Stundentafel!$A$22:$J$64,10,FALSE)","v":"-"},{"$f":"VLOOKUP(Rechenblatt!M29,Stundentafel!$A$22:$J$64,10,FALSE)","v":"-"},null,{"$f":"Rechenblatt!AL29","v":0},{"$f":"Rechenblatt!AK29","v":0},{"$f":"Rechenblatt!BA29","v":0}]
["FOS 13",0,0,0,0,0,0,0,{"$f":"VLOOKUP(Rechenblatt!L30,Stundentafel!$A$22:$J$64,10,FALSE)","v":"-"},{"$f":"VLOOKUP(Rechenblatt!M30,Stundentafel!$A$22:$J$64,10,FALSE)","v":"-"},null,{"$f":"Rechenblatt!AL30","v":0},{"$f":"Rechenblatt!AK30","v":0},{"$f":"Rechenblatt!BA30","v":0}]
["zusammen",{"$f":"SUM(B38:B42)","v":0},0,0,0,0,0,0,{"$f":"COUNTIF(Rechenblatt!L28:L30,\">0\")","v":0},{"$f":"COUNTIF(Rechenblatt!M28:M30,\">0\")","v":0},null,{"$f":"SUM(L38:L42)","v":0},{"$f":"SUM(M38:M42)","v":0},"(Block 1)"]
["fpT-Gruppen",{"$f":"Rechenblatt!C72","v":0},null,null,{"$f":"Rechenblatt!F72","v":0},{"$f":"Rechenblatt!G72","v":0},null,null,null,null,null,{"$f":"SUM(B44:K44)","v":0},{"$f":"L44*Stundentafel!$J$2","v":0},{"$f":"Rechenblatt!J73","v":0}]
[null,"ausbildungsrichtungsreine Klassen",null,null,null,null,null,null,"Mischklassen"]
["BOS","T","W","S","G","A","IW","GP","MKl_1","MKl_2","o. Abr","Klassen","Stdtfl"]
["Vorkurs",null,null,null,0,null,null,null,null,null,{"$f":"Rechenblatt!AL35","v":0},{"$f":"SUM(B47:K47)","v":0},{"$f":"Rechenblatt!AK35","v":0}]
["Vorklasse",null,null,null,0,null,null,null,null,null,{"$f":"Rechenblatt!AL36","v":0},{"$f":"SUM(B48:K48)","v":0},{"$f":"Rechenblatt!AK36","v":0}]
["BOS 12",{"$f":"Rechenblatt!AC37:AI40","v":0},0,0,0,0,0,0,{"$f":"VLOOKUP(Rechenblatt!L37,Stundentafel!$A$22:$J$64,10,FALSE)","v":"-"},{"$f":"VLOOKUP(Rechenblatt!M37,Stundentafel!$A$22:$J$64,10,FALSE)","v":"-"},null,{"$f":"Rechenblatt!AL37","v":0},{"$f":"Rechenblatt!AK37","v":0}]
["BOS 12_1",0,0,0,0,0,0,0,{"$f":"VLOOKUP(Rechenblatt!L38,Stundentafel!$A$22:$J$64,10,FALSE)","v":"-"},{"$f":"VLOOKUP(Rechenblatt!M38,Stundentafel!$A$22:$J$64,10,FALSE)","v":"-"},null,{"$f":"Rechenblatt!AL38","v":0},{"$f":"Rechenblatt!AK38","v":0}]
["BOS 12_2",0,0,0,0,0,0,0,{"$f":"VLOOKUP(Rechenblatt!L39,Stundentafel!$A$22:$J$64,10,FALSE)","v":"-"},{"$f":"VLOOKUP(Rechenblatt!M39,Stundentafel!$A$22:$J$64,10,FALSE)","v":"-"},null,{"$f":"Rechenblatt!AL39","v":0},{"$f":"Rechenblatt!AK39","v":0}]
["BOS 13",0,0,0,0,0,0,0,{"$f":"VLOOKUP(Rechenblatt!L40,Stundentafel!$A$22:$J$64,10,FALSE)","v":"-"},{"$f":"VLOOKUP(Rechenblatt!M40,Stundentafel!$A$22:$J$64,10,FALSE)","v":"-"},null,{"$f":"Rechenblatt!AL40","v":0},{"$f":"Rechenblatt!AK40","v":0}]
["zusammen",{"$f":"SUM(B47:B52)","v":0},0,0,0,0,0,0,{"$f":"COUNTIF(Rechenblatt!L37:L40,\">0\")","v":0},{"$f":"COUNTIF(Rechenblatt!M37:M40,\">0\")","v":0},null,{"$f":"SUM(L47:L52)","v":0},{"$f":"SUM(M47:M52)","v":0},"(Block 1)"]
[]
[{"$f":"\"Block 1: Pflichtunterricht/Wahlpflichtunterricht \"&schuljahr","v":"Block 1: Pflichtunterricht/Wahlpflichtunterricht 2023/24"}]
[null,null,null,null,null,null,null,"FOS","BOS","insg"]
["1.1. Stundentafel (ohne WPF, 2. FSpr, FöUnt; RU/Eth, Spo)",null,null,null,null,null,null,{"$f":"SUM(Rechenblatt!BA26:BA30)","v":0},{"$f":"SUM(Rechenblatt!BA35:BA40)","v":0},{"$f":"SUM(H57:I57)","v":0}]
["1.2. Förderunterricht der Stundentafel (FOS 11)",null,null,null,null,null,null,{"$f":"Rechenblatt!EV28","v":0},0,{"$f":"SUM(H58:I58)","v":0}]
["1.3. Wahlpflichtfächer-Grundbedarf 12 (ohne FSpr/Abi)",null,null,null,null,null,null,{"$f":"Rechenblatt!AJ49","v":0},{"$f":"Rechenblatt!AK49","v":0},0]
["1.4. Wahlpflichtfächer-Grundbedarf 13 (ohne FSpr/Abi. Seminar)",null,null,null,null,null,null,{"$f":"Rechenblatt!AJ50","v":0},{"$f":"Rechenblatt!AK50","v":0},0]
["1.5. WPF Fremdsprache zur Hochschulreife - Grundbedarf",null,null,null,null,null,null,{"$f":"Rechenblatt!AL93","v":0},{"$f":"Rechenblatt!AM93","v":0},0]
["1.6. Profilfach Fremdsprache ABR IW - Grundbedarf",null,null,null,null,null,null,{"$f":"SUM(Rechenblatt!H61:H63)","v":0},{"$f":"SUM(Rechenblatt!H64:H67)","v":0},0]
["1.7. Grundbedarf Seminar gem. §17 FOBOS (Jgst. 13)",null,null,null,null,null,null,{"$f":"Rechenblatt!W44","v":0},{"$f":"Rechenblatt!X44","v":0},{"$f":"SUM(H63:I63)","v":0}]
["1.8. DBFH (1.-3. Ausbildungsjahr); FOS-Stunden",null,null,null,null,null,null,{"$f":"Rechenblatt!K81","v":0},0,{"$f":"SUM(H64:I64)","v":0}]
["1.9. Integrationsvorklasse (Grundbedarf)",null,null,null,null,null,null,{"$f":"Rechenblatt!E86","v":0},0,0]
["1.10. Reduktion für Splittergruppen-Profile in Jgst. 13",null,null,null,null,null,null,null,null,{"$f":"SUM(H66:I66)","v":0}]
["1.11. Einsparung durch gemeinsame Beschulung FOS13/BOS13 ",null,null,null,null,null,null,null,null,0]
["Block 1",null,null,null,null,null,null,{"$f":"SUM(H57:H67)","v":0},{"$f":"SUM(I57:I67)","v":0},{"$f":"SUM(H68:I68)","v":0}]
[]
[{"$f":"\"Block 2: Zusatzbedarf für Gruppenbildung und Teilungen \"&schuljahr","v":"Block 2: Zusatzbedarf für Gruppenbildung und Teilungen 2023/24"}]
[null,null,null,null,null,null,null,"FOS","BOS","insg"]
["2.1. Vorklasse: weitere Teilungen im Profilbereich",null,null,null,null,null,null,{"$f":"Rechenblatt!Z86","v":0},{"$f":"Rechenblatt!AA86","v":0},{"$f":"SUM(H72:I72)","v":0}]
["2.2. Teilungsstunden in Profilfächern",null,null,null,null,null,null,{"$f":"Rechenblatt!BK50","v":0},{"$f":"Rechenblatt!BK60","v":0},{"$f":"SUM(H73:I73)","v":0}]
["2.3. Religion/Ethik (Stdtafel+Teilung)",null,null,null,null,null,null,{"$f":"Rechenblatt!CU24","v":0},{"$f":"Rechenblatt!CU33","v":0},0]
["2.4. Sportklassen (Stdtafel+Teilung)",null,null,null,null,null,null,{"$f":"Rechenblatt!CA24","v":0},0,0]
["2.5. Teilungen Praxisanteile WPF Informatik",null,null,null,null,null,null,{"$f":"Rechenblatt!L54+Rechenblatt!L56","v":0},{"$f":"Rechenblatt!L55+Rechenblatt!L57","v":0},0]
["2.6. WPF Fremdsprache allg. Hochschulreife - Zusatzbedarf",null,null,null,null,null,null,{"$f":"Rechenblatt!AQ93","v":0},{"$f":"Rechenblatt!AR93","v":0},0]
["2.7. Profilfach Fremdsprache ABR IW - Zusatzbedarf",null,null,null,null,null,null,{"$f":"SUM(Rechenblatt!I61:I63)","v":0},{"$f":"SUM(Rechenblatt!I64:I67)","v":0},0]
["Block 2",null,null,null,null,null,null,{"$f":"SUM(H72:H78)","v":0},{"$f":"SUM(I72:I78)","v":0},{"$f":"SUM(H79:I79)","v":0}]
[]
[{"$f":"\"Block 3: individuelle Förderung, Wahlunterricht \"&schuljahr","v":"Block 3: individuelle Förderung, Wahlunterricht 2023/24"}]
[null,null,null,null,null,null,null,"FOS","BOS","insg"]
["3.1. Ergänzungsunterricht (ohne FOS11/BOS12)",null,null,null,null,null,null,{"$f":"Rechenblatt!DQ24","v":0},{"$f":"Rechenblatt!DQ33","v":0},{"$f":"SUM(H83:I83)","v":0}]
["3.2. Differenzierungen, pädagog. Teilungen",null,null,null,null,null,null,{"$f":"Rechenblatt!EB24","v":0},{"$f":"Rechenblatt!EB33","v":0},{"$f":"SUM(H84:I84)","v":0}]
["3.3. Teilung Förderunterricht FOS 11 (WPF)",null,null,null,null,null,null,{"$f":"Rechenblatt!EW28","v":0},0,0]
["3.4. \"Intensivierungsstunden\" BOS 12",null,null,null,null,null,null,0,{"$f":"SUM(Rechenblatt!EV37:EV39)","v":0},0]
["3.5. Wahlunterricht",null,null,null,null,null,null,{"$f":"Rechenblatt!ED24","v":0},{"$f":"Rechenblatt!ED33","v":0},0]
["3.6. Wahlfreiheitszuschlag in Wahlpflichtfächern (12/13)",null,null,null,null,null,null,{"$f":"SUM(Rechenblatt!AM49:AM50)","v":0},{"$f":"SUM(Rechenblatt!AN49:AN50)","v":0},0]
["3.7. freiwillige Wahl eines zusätzlichen WPF (12/13)",null,null,null,null,null,null,{"$f":"SUM(Rechenblatt!AP49:AP50)","v":0},{"$f":"SUM(Rechenblatt!AQ49:AQ50)","v":0},0]
["3.8. Zuschlag für Seminare gem. § 17 FOBOSO",null,null,null,null,null,null,{"$f":"Rechenblatt!Z44","v":0},{"$f":"Rechenblatt!AA44","v":0},{"$f":"SUM(H90:I90)","v":0}]
["3.9. individuelle Förderung Integrationsvorklasse ",null,null,null,null,null,null,{"$f":"Rechenblatt!G86","v":0},0,{"$f":"SUM(H91:I91)","v":0}]
["Block 3",null,null,null,null,null,null,{"$f":"SUM(H83:H91)","v":0},{"$f":"SUM(I83:I91)","v":0},{"$f":"SUM(H92:I92)","v":0}]
["Unterricht aus Block 1 bis 3 (ohne FPA)",null,null,null,null,null,null,{"$f":"SUM(H68,H79,H92)","v":0},{"$f":"SUM(I68,I79,I92)","v":0},{"$f":"SUM(H93:I93)","v":0}]
[]
[{"$f":"\"4. Fachpraktische Ausbildung (FPA) \"&schuljahr","v":"4. Fachpraktische Ausbildung (FPA) 2023/24"}]
["4.1. fpT - fachpraktische Tätigkeit",null,null,null,null,null,null,{"$f":"N44","v":0},0,{"$f":"SUM(H96:I96)","v":0}]
["4.2. fpAn - fachpraktische Anleitung",null,null,null,null,null,null,{"$f":"Rechenblatt!M71","v":0},0,0]
["4.3.1. fpV - fachpraktische Vertiefung (Grundbedarf)",null,null,null,null,null,null,{"$f":"Rechenblatt!N71","v":0},0,0]
["4.3.2. fpV - fachpraktische Vertiefung (Teilungsmehrbedarf)",null,null,null,null,null,null,{"$f":"Rechenblatt!AB71","v":0},0,0]
["4.4. fpB - fachpraktische Betreuung",null,null,null,null,null,null,{"$f":"Rechenblatt!R71","v":0},0,0]
["FPA in der 4. QE (= fpV+fpAn+fpB)",null,null,null,null,null,null,{"$f":"SUM(H97:H100)","v":0},{"$f":"SUM(I97:I100)","v":0},0]
["FPA in der 3. QE (= fpT)",null,null,null,null,null,null,{"$f":"H96","v":0},{"$f":"I96","v":0},0]
["Unterrichtsbudget (neue Stundentafeln)",null,null,null,null,null,null,{"$f":"SUM(H101:H102,H93)","v":0},{"$f":"SUM(I101:I102,I93)","v":0},{"$f":"SUM(H103:I103)","v":0}]
[{"$f":"\"Zusammenfassung \"&schuljahr","v":"Zusammenfassung 2023/24"}]
[null,null,null,null,null,null,null,"FOS","BOS","insg"]
["nach Jgst.","Vorkurse",null,null,null,null,null,{"$f":"TRANSPOSE(Rechenblatt!H150:L150)","v":0},{"$f":"TRANSPOSE(Rechenblatt!P150:T150)","v":0},{"$f":"SUM(H106:I106)","v":0}]
[null,"Vorklassen ",null,null,null,null,null,0,0,0]
[null,"Jahrgangsstufe 11 (einschl. FPA)",null,null,null,null,null,0,0,{"$f":"SUM(H108:I108)","v":0}]
[null,"Jahrgangsstufe 12",null,null,null,null,null,0,0,0]
[null,"Jahrgangsstufe 13",null,null,null,null,null,0,0,0]
[null,"DBFH (1. - 3. Ausbildungsjahr)",null,null,null,null,null,{"$f":"Rechenblatt!M150","v":0},{"$f":"Rechenblatt!U150","v":0},0]
[{"$f":"\"Unterrichtsbudget (einschl. FPA) \"&schuljahr","v":"Unterrichtsbudget (einschl. FPA) 2023/24"},null,null,null,null,null,null,{"$f":"SUM(H106:H111)","v":0},{"$f":"SUM(I106:I111)","v":0},{"$f":"SUM(H112:I112)","v":0}]

{"sheet":"VUÜ-SK","index":2,"n_rows":80,"n_cols":40,"rows_kept":80,"cut":false,"hidden":false,"merged":[[4,29,5,29],[41,29,42,29],[19,1,20,1],[19,2,20,2],[63,1,64,1],[63,2,64,2],[54,1,55,1],[54,2,55,2],[60,1,61,1],[60,2,61,2],[27,1,29,1],[24,1,26,1],[41,13,41,20],[41,21,41,28],[22,5,22,12],[4,5,4,12],[2,1,2,2],[4,13,4,20],[4,21,4,28],[33,5,33,6],[41,4,41,6],[41,7,41,11]]}
[null,{"$f":"\"Schüler- und Klassenzahlen (VUÜ-SK)  im Schuljahr \"&schuljahr","v":"Schüler- und Klassenzahlen (VUÜ-SK)  im Schuljahr 2023/24"}]
[]
[null,"Eingabefelder"]
[null,"1. Fachoberschule:"]
[null,"Schulnummer",null,{"$f":"IF(Übersicht!G3=\"\",\"\",Übersicht!G3)","v":""},"Vor-","FOS 11",null,null,null,null,null,null,null,"FOS 12",null,null,null,null,null,null,null,"FOS 13",null,null,null,null,null,null,null,"FOS"]
[null,"1.1 Schülerzahlen für Klassenbildung FOS",null,null,"klasse","T","W","S","G","A","IW","GP","FOS11","T","W","S","G","A","IW","GP","FOS12","T","W","S","G","A","IW","GP","FOS13"]
[null,"Z1","Gesamtzahl Neuanmeldungen (Schnitt erreicht)1) ",null,null,null,null,null,null,null,null,null,{"$f":"SUM(F7:L7)","v":0},null,null,null,null,null,null,null,{"$f":"SUM(N7:T7)","v":0},null,null,null,null,null,null,null,{"$f":"SUM(V7:AB7)","v":0},{"$f":"SUM(E7,M7,U7,AC7)","v":0}]
[null,"Z2","voraussichtliche Wiederholungsschüler",null,null,null,null,null,null,null,null,null,{"$f":"SUM(F8:L8)","v":0},null,null,null,null,null,null,null,{"$f":"SUM(N8:T8)","v":0},null,null,null,null,null,null,null,{"$f":"SUM(V8:AB8)","v":0},{"$f":"SUM(E8,M8,U8,AC8)","v":0}]
[null,"Z3","voraussichtliche Aufsteiger",null,null,null,null,null,null,null,null,null,{"$f":"SUM(F9:L9)","v":0},null,null,null,null,null,null,null,{"$f":"SUM(N9:T9)","v":0},null,null,null,null,null,null,null,{"$f":"SUM(V9:AB9)","v":0},{"$f":"SUM(E9,M9,U9,AC9)","v":0}]
[null,"Z4","Summe (Z1+Z2+Z3)",null,{"$f":"SUM(E7:E9)","v":0},{"$f":"SUM(F7:F9)","v":0},0,0,0,0,0,0,0,0,0,0,0,0,0,0,0,0,0,0,0,0,0,0,0,0]
[null,"Z5","gewichtete Antrittsquote von Z4 (max. 1,00)"]
[null,"Z6","Gesamtzahl Neuanmeldungen (Schnitt nicht erreicht)2)"]
[null,"Z7","geschätzte Antrittsquote von Z6 (für FOS11: 0,15)"]
[null,"Z8","voraussichtliche Schülerzahl (Z4*Z5+Z6*Z7)",null,{"$f":"ROUND(E10*E11+E12*E13,0)","v":0},{"$f":"ROUND(F10*F11+F12*F13,0)","v":0},0,0,0,0,0,0,{"$f":"SUM(F14:L14)","v":0},0,0,0,0,0,0,0,{"$f":"SUM(N14:T14)","v":0},0,0,0,0,0,0,0,{"$f":"SUM(V14:AB14)","v":0},{"$f":"SUM(E14,M14,U14,AC14)","v":0},null,null,null,{"$f":"IF(V14<8,0,V14)","v":0},{"$f":"IF(W14<8,0,W14)","v":0},{"$f":"IF(Z14<8,0,Z14)","v":0},{"$f":"IF(AA14<8,0,AA14)","v":0},{"$f":"IF(AB14<8,0,AB14)","v":0},null,{"$f":"SUM(AH14:AL14)","v":0}]
[null,"Z9","geplante Klassenfrequenz",null,{"$f":"IF(E16>0,E14/E16,0)","v":0},{"$f":"IF(F16>0,F14/F16,0)","v":0},0,0,{"$f":"IF(I16>0,I14/I16,0)","v":0},{"$f":"IF(J16>0,J14/J16,0)","v":0},0,0,0,{"$f":"IF(N16>0,N14/N16,0)","v":0},0,0,0,0,0,0,0,{"$f":"IF(V16>0,V14/V16,0)","v":0},0,0,0,0,0,0,0,0]
[null,"Z10",{"$f":"\"geplante Klassenzahl \"&schuljahr","v":"geplante Klassenzahl 2023/24"},null,null,null,null,null,null,null,null,null,{"$f":"SUM(F16:L16)","v":0},null,null,null,null,null,null,null,{"$f":"SUM(N16:T16)","v":0},null,null,null,null,null,null,null,{"$f":"SUM(V16:AB16)","v":0},{"$f":"SUM(E16,M16,U16,AC16)","v":0}]
[null,"Z11",{"$f":"\"Klassenzahl gesamt \"&vorjahr","v":"Klassenzahl gesamt 2022/23"},null,null,null,null,null,null,null,null,null,{"$f":"SUM(F17:L17)","v":0},null,null,null,null,null,null,null,{"$f":"SUM(N17:T17)","v":0},null,null,null,null,null,null,null,{"$f":"SUM(V17:AB17)","v":0},{"$f":"SUM(E17,M17,U17,AC17)","v":0}]
[null,"Z12","Differenz (Z10-Z11)",null,{"$f":"E16-E17","v":0},0,0,0,{"$f":"I16-I17","v":0},{"$f":"J16-J17","v":0},0,0,{"$f":"M16-M17","v":0},0,0,{"$f":"P16-P17","v":0},{"$f":"Q16-Q17","v":0},0,0,0,0,0,0,{"$f":"X16-X17","v":0},{"$f":"Y16-Y17","v":0},0,0,0,0,0]
[]
[null,"Z13","Vorkurs FOS","vorauss. Schülerzahl",null,null,null,"1)  für 11. Kl.: D, E, M <= 3,5 im Zwischenzeugnis bzw. für FOS13: Durchschnitt im Zwischenzeugnis <= 3,0"]
[null,null,null,"geplante Klassenzahl",null,null,null,"2)  für 11. Kl.: D, E, M > 3,5 im Zwischenzeugnis bzw. für FOS13: Durchschnitt im Zwischenzeugnis > 3,0 (max. 3,2)"]
[]
[null,"1.2 Fachpraktische Ausbildung (FOS 11)",null,null,null,"FOS 11 (FPA)"]
[null,null,null,null,null,"T","W","S","G","A","IW","GP","Ges"]
[null,{"$f":"schuljahr","v":"2023/24"},"Z8 Schülerzahl Jgst. 11 (eigene Schule)",null,null,{"$f":"F14","v":0},0,0,0,0,0,0,{"$f":"SUM(F25:L25)","v":0}]
[null,null,"   E: darunter in fpT in schulint. Ausbildungswerkstatt",null,null,null,null,null,null,null,null,null,0]
[null,null,"   A zzgl. Schüler anderer FOS in schulint. Werkstatt",null,null,null,null,null,null,null,null,null,0]
[null,{"$f":"vorjahr","v":"2022/23"},{"$f":"\"Z8' Schülerzahl Jgst. 11 (eigene Schule) - \"&vorjahr","v":"Z8' Schülerzahl Jgst. 11 (eigene Schule) - 2022/23"},null,null,null,null,null,null,null,null,null,0]
[null,null,{"$f":"\"   E' darunter in fpT in schulint. Werkstatt - \"&vorjahr","v":"   E' darunter in fpT in schulint. Werkstatt - 2022/23"},null,null,null,null,null,null,null,null,null,0]
[null,null,{"$f":"\"   B' Anzahl der Ausbildungsstätten - \"&vorjahr","v":"   B' Anzahl der Ausbildungsstätten - 2022/23"},null,null,null,null,null,null,null,null,null,0]
[null,null,"Gesamtanzahl der Ausbildungsstätten B "]
[]
[]
[null,"1.3 DBFH",null,null,null,"Schüler"]
[null,"(Schülerzahlen nach Ausbildungsjahr)",null,null,null,"T","W"]
[null,"1. Ausbildungsjahr",null,null,null,null,0]
[null,"2. Ausbildungsjahr",null,null,null,null,0]
[null,"3. Ausbildungsjahr (Abschnitt 13/1)",null,null,null,null,0]
[null,"3. Ausbildungsjahr (Abschnitt 13/2); Eingabe, sofern abweichend",null,null,null,null,{"$f":"G38","v":0}]
[]
[null,"2. Berufsoberschule:"]
[null,"Schulnummer",null,{"$f":"IF(Übersicht!G4=\"\",\"\",Übersicht!G4)","v":""},"TZ-BOS 1.J",null,null,"TZ-BOS 2.J",null,null,null,null,"Vor-","BOS 12",null,null,null,null,null,null,null,"BOS 13",null,null,null,null,null,null,null,"BOS"]
[null,"2.1 Schülerzahlen für Klassenbildung BOS",null,null,"T","W",null,"T","W",null,null,null,"klasse","T","W","S",null,"A","IW","GP","BOS12","T","W","S",null,"A","IW","GP","BOS13"]
[null,"Z1","Gesamtzahl der Neuanmeldungen",null,null,null,null,null,null,null,null,null,null,null,null,null,null,null,null,null,{"$f":"SUM(N44:T44)","v":0},null,null,null,null,null,null,null,{"$f":"SUM(V44:AB44)","v":0},{"$f":"SUM(M44,U44,AC44)","v":0}]
[null,"Z2","voraussichtliche Wiederholungsschüler",null,null,null,null,null,null,null,null,null,null,null,null,null,null,null,null,null,{"$f":"SUM(N45:T45)","v":0},null,null,null,null,null,null,null,{"$f":"SUM(V45:AB45)","v":0},0]
[null,"Z3","voraussichtliche Aufsteiger",null,null,null,null,null,null,null,null,null,null,null,null,null,null,null,null,null,{"$f":"SUM(N46:T46)","v":0},null,null,null,null,null,null,null,{"$f":"SUM(V46:AB46)","v":0},0]
[null,"Z4","Summe (Z1+Z2+Z3)",null,null,null,null,null,null,null,null,null,{"$f":"M44+M45","v":0},{"$f":"N44+N45+N46","v":0},{"$f":"O44+O45+O46","v":0},{"$f":"P44+P45+P46","v":0},null,null,{"$f":"S44+S45+S46","v":0},{"$f":"T44+T45+T46","v":0},{"$f":"SUM(N47:T47)","v":0},{"$f":"SUM(V44:V46)","v":0},{"$f":"SUM(W44:W46)","v":0},0,null,0,0,0,{"$f":"SUM(V47:AB47)","v":0},{"$f":"SUM(M47,U47,AC47)","v":0}]
[null,"Z5","gewichtete Antrittsquote von Z4 (max. 1,00)"]
[null,"Z6","voraussichtliche Schülerzahl (Z4*Z5)",null,null,null,null,null,null,null,null,null,{"$f":"ROUND(M47*M48,0)","v":0},{"$f":"ROUND(N47*N48,0)","v":0},0,0,null,0,0,0,{"$f":"SUM(N49:T49)","v":0},0,0,0,null,0,0,0,{"$f":"SUM(V49:AB49)","v":0},{"$f":"SUM(E49:F49,H49:I49,M49,U49,AC49)","v":0},null,null,null,{"$f":"IF(V49<8,0,V49)","v":0},{"$f":"IF(W49<8,0,W49)","v":0},{"$f":"IF(Z49<8,0,Z49)","v":0},{"$f":"IF(AA49<8,0,AA49)","v":0},{"$f":"IF(AB49<8,0,AB49)","v":0},null,{"$f":"SUM(AH49:AL49)","v":0}]
[null,"Z7","geplante Klassenfrequenz",null,{"$f":"IF(E51>0,E49/E51,0)","v":0},{"$f":"IF(F51>0,F49/F51,0)","v":0},null,{"$f":"IF(H51>0,H49/H51,0)","v":0},{"$f":"IF(I51>0,I49/I51,0)","v":0},null,null,null,{"$f":"IF(M51>0,M49/M51,0)","v":0},{"$f":"IF(N51>0,N49/N51,0)","v":0},{"$f":"IF(O51>0,O49/O51,0)","v":0},{"$f":"IF(P51>0,P49/P51,0)","v":0},null,null,{"$f":"IF(S51>0,S49/S51,0)","v":0},0,0,0,0,0,null,{"$f":"IF(Z51>0,Z49/Z51,0)","v":0},{"$f":"IF(AA51>0,AA49/AA51,0)","v":0},{"$f":"IF(AB51>0,AB49/AB51,0)","v":0},{"$f":"IF(AC51>0,AC49/AC51,0)","v":0},{"$f":"IF(AD51>0,AD49/AD51,0)","v":0}]
[null,"Z8",{"$f":"\"geplante Klassenzahl \"&schuljahr","v":"geplante Klassenzahl 2023/24"},null,null,null,null,null,null,null,null,null,null,null,null,null,null,null,null,null,{"$f":"SUM(N51:T51)","v":0},null,null,null,null,null,null,null,{"$f":"SUM(V51:AB51)","v":0},{"$f":"SUM(E51:F51,H51:I51,M51,U51,AC51)","v":0}]
[null,"Z9",{"$f":"\"Klassenzahl gesamt \"&vorjahr","v":"Klassenzahl gesamt 2022/23"},null,null,null,null,null,null,null,null,null,null,null,null,null,null,null,null,null,{"$f":"SUM(N52:T52)","v":0},null,null,null,null,null,null,null,{"$f":"SUM(V52:AB52)","v":0},{"$f":"SUM(E52:F52,H52:I52,M52,U52,AC52)","v":0}]
[null,"Z10","Differenz (Z8-Z9)",null,{"$f":"E51-E52","v":0},{"$f":"F51-F52","v":0},null,{"$f":"H51-H52","v":0},{"$f":"I51-I52","v":0},null,null,null,{"$f":"M51-M52","v":0},{"$f":"N51-N52","v":0},{"$f":"O51-O52","v":0},{"$f":"P51-P52","v":0},null,null,{"$f":"S51-S52","v":0},0,0,0,0,0,null,null,{"$f":"AA51-AA52","v":0},{"$f":"AB51-AB52","v":0},{"$f":"AC51-AC52","v":0},0]
[]
[null,"Z11","Vorkurs BOS","vorauss. Schülerzahl"]
[null,null,null,"geplante Klassenzahl"]
[]
[null,"3. Fachoberschule und Berufsoberschule"]
[]
[null,"3.1 Brückenangebote für aus dem Ausland zugezogene Jugendliche und Erwachsene mit nichtdeutscher Muttersprache"]
[null,"Z12","Integrations-\nVorklasse FOS/BOS","vorauss. Schülerzahl"]
[null,null,null,"geplante Klassenzahl"]
[null,"nachrichtlich (außerhalb des Budgets)"]
[null,"Z13","Berufsintegrations-\nklassen an FOS/BOS","vorauss. Schülerzahl"]
[null,null,null,"geplante Klassenzahl"]
[]
[null,"3.2 Fremdsprache zur Erlangung der allgemeinen Hochschulreife (FOS/BOS gemeinsam)"]
[null,null,null,"Schüler (FOS/BOS)","Spa","Fra","Ita","Lat","Rus","Ges"]
[null,"Jgst. 12",null,{"$f":"U14+U49","v":0},null,null,null,null,null,{"$f":"SUM(E69:I69)","v":0}]
[null,"Jgst. 13",null,{"$f":"AC14+AC49","v":0},null,null,null,null,null,{"$f":"SUM(E70:I70)","v":0}]
[]
[null,{"$f":"\"3.3 Daten für das dem Planungsjahr vorangehende Schuljahr \"&vorjahr&\" (Projektion)\"","v":"3.3 Daten für das dem Planungsjahr vorangehende Schuljahr 2022/23 (Projektion)"}]
[null,"3.3.1 Schüler nach Geschlecht",null,null,null,null,null,null,null,"3.3.2 Teilnahme am Religions-/Ethikunterricht (sofern eingerichtet)"]
[null,"Sport (Geschlecht)",null,null,null,"männl","weibl","insg",null,"Religion/Ethik",null,null,null,null,"rk","ev","son**","eth"]
[null,{"$f":"\"FOS 11 (\"&vorjahr&\")\"","v":"FOS 11 (2022/23)"},null,null,null,null,null,{"$f":"SUM(F75:G75)","v":0},null,{"$f":"\"FOS 12 (\"&vorjahr&\")\"","v":"FOS 12 (2022/23)"}]
[null,null,null,null,null,null,null,null,null,{"$f":"\"FOS insgesamt* (\"&vorjahr&\")\"","v":"FOS insgesamt* (2022/23)"}]
[null,null,null,null,null,null,null,null,null,{"$f":"\"BOS 12 (\"&vorjahr&\")\"","v":"BOS 12 (2022/23)"}]
[null,null,null,null,null,null,null,null,null,{"$f":"\"BOS insgesamt (\"&vorjahr&\")\"","v":"BOS insgesamt (2022/23)"}]
[null,null,null,null,null,null,null,null,null,"* ohne Schüler in Jahrgangsstufe 11, für die kein Religions-/Ethikunterricht vorgesehen ist"]
[null,null,null,null,null,null,null,null,null,"** orthodox, islamischer Unterricht, weiterer Religionsunterricht gem. Art. 46 BayEUG"]

{"sheet":"VUÜ-PP","index":3,"n_rows":50,"n_cols":19,"rows_kept":50,"cut":false,"hidden":true,"merged":[[3,15,6,18],[32,17,32,18],[33,17,33,18],[8,16,15,16],[21,17,21,18],[8,17,15,18],[16,17,16,18],[0,0,1,1],[26,17,26,18],[22,17,22,18],[8,15,15,15],[18,17,18,18],[25,17,25,18],[23,17,23,18],[24,17,24,18],[19,17,19,18],[20,17,20,18],[17,17,17,18],[8,6,15,6],[8,14,15,14],[8,13,15,13],[8,12,15,12],[8,10,15,10],[8,7,15,7],[8,8,15,8],[8,11,15,11],[8,9,15,9],[16,5,20,5],[30,5,40,5],[21,5,29,5],[42,17,42,18],[40,17,40,18],[41,17,41,18],[36,17,36,18],[37,17,37,18],[38,17,38,18],[39,17,39,18],[30,3,31,3],[34,3,35,3],[27,0,28,1],[35,17,35,18],[27,17,27,18],[28,17,28,18],[34,17,34,18],[29,17,29,18],[30,17,30,18],[31,17,31,18],[30,0,31,0],[30,1,31,1],[30,2,31,2],[34,0,35,0],[34,1,35,1],[34,2,35,2]]}
["UPZ + AZK",null,null,null,null,"Personalplanung für das Schuljahr 2020/21 (VUÜ-PP)",null,null,null,null,null,null,null,null,null,null,null,{"$f":"IF(Übersicht!G3<>\"\",Übersicht!G3,\"\")","v":""},"SchNr. FOS"]
[null,null,null,null,null,null,null,null,null,null,null,null,null,null,null,null,null,{"$f":"IF(Übersicht!G4<>\"\",Übersicht!G4,\"\")","v":""},"SchNr. BOS"]
[]
[null,null,null,null,null,null,null,null,null,null,null,null,null,null,null,{"$f":"IF(Übersicht!D1<>\"\",Übersicht!D1,\"\")","v":""}]
[]
["A) Bedarfsberechnung",null,null,null,null,null,"B) Personalmaßnahmen "]
[null,null,null,null,null,null,"(Deckung von Bedarf, Abbau von Überhängen)"]
["a) Berechnung Gesamtbudget"]
["Unterrichtsbudget einschl. FPA",null,null,{"$f":"'VUÜ-Budget'!J112","v":0},null,null,"Art der Maßnahme (Ref,N,V+,V-,R,E,AV,AO,nb)","Fächerverbindung","Name","Ref. Stellen","Ref. Stunden","N,V+,V-,E,R (Stellen)","N,V+,V-,E,R (Std)","AO Stunden","AV Stellen","AV Stunden","nb Stunden","Bemerkungen"]
["darunter FPA 4. QE (fpV, fpAn, fpB)",null,null,{"$f":"'VUÜ-Budget'!J101","v":0}]
["darunter FPA 3. QE (fpT)",null,null,{"$f":"'VUÜ-Budget'!J102","v":0}]
["+ Inklusion 7"]
["+ Anrechnungen (schulgeb.) 1"]
["= errechnetes Gesamtbudget (GB*)",null,null,{"$f":"D9+D13+D12","v":0}]
["- Kürzung (in %)",null,null,0]
["= gekürztes Gesamtbudget (GB)",null,null,{"$f":"D14*(1-D15/100)","v":0}]
[null,null,null,null,null,"Referendare"]
["b) verfügbare Stunden (Stammpersonal)"]
["dauerh. beschäftigtes Personal2"]
["+ Zugänge/Abgänge seit 20.10.3"]
["+ Teilzeitänderungen seit 20.10.4"]
["- Abbau von Mehrungen aus Vorjahr5",null,null,null,null,"Neu., Entfr., Vers.,\nRückkehr"]
["- Ermäß. (Alter, Beh.)"]
["- Anrechnungen (nicht schulgeb.) 6"]
["- max. Einsatzstunden für mobile Reserve(n)"]
["= verfügb. Stunden (VSt)",null,null,{"$f":"D19+D20+D21-D22-D23-D24-D25","v":0}]
[]
["c) Bedarf ( + ) bzw. Überhang ( - )"]
[]
["D, E, G, Sk ...","M, Ph, C, B, Te …","WW","PP"]
[null,null,null,null,null,"AbOrdnungen, AushVertr, nebenberufl. Lehrkräfte"]
[]
[]
["K, Ev, Eth","Ku, Mu","fpA","Smw/Sonst"]
[]
[]
[]
[]
[null,"Σ Tabelle","lt. VUÜ","nach Kürz."]
[null,null,"GB* - VSt","GB - VSt"]
["Gesamt",{"$f":"SUM(A31:D32,A35:D36)","v":0},{"$f":"D14-D26","v":0},{"$f":"D16-D26","v":0}]
[null,null,null,null,null,null,null,null,null,null,null,null,null,null,null,null,null,"Summe - Stunden"]
["1) vgl. KM-Bek zur UPZ der Lehrer an ber.Sch.",null,null,null,null,null,null,null,"Einzelsummen",{"$f":"SUM(J17:J21)","v":0},{"$f":"SUM(K17:K21)","v":0},{"$f":"SUM(L22:L30)","v":0},{"$f":"SUM(M22:M30)","v":0},{"$f":"SUM(N31:N41)","v":0},{"$f":"SUM(O31:O41)","v":0},{"$f":"SUM(P31:P41)","v":0},{"$f":"SUM(Q31:Q41)","v":0},{"$f":"K43+M43+N43+P43+Q43","v":0}]
["2) vgl. ASD \"vorh.UPZ von ha/hb'+AU'-Lehrern\""]
["3) vgl. VUÜ-PV 1 und 2"]
["4) vgl. VUÜ-PV 1 und 2",null,null,null,null,null,"C) Freiwilliges Arbeitszeitkonto (absolute Gesamtsumme seit dem Schuljahr 2007/08)"]
["5) vgl. VUÜ-PV 3"]
["6) nicht schulgebundene Anrechnungen sind z.B. Seminarlehrer-",null,null,null,null,null,null,"1. der 4. QE (=höherer Dienst)",null,null,null,"(absolute Gesamtsumme)",null,null,null,null,null,null,"Wochenst."]
["    tätigkeit, Mitarbeit beim ISB, Mitglied einer Aufgabenkommission, …"]
["7) wird ausschließlich durch das StM nach Genehmigung eingetragen",null,null,null,null,null,null,"2. der 3. QE (=gehobener Dienst)",null,null,null,"(absolute Gesamtsumme)",null,null,null,null,null,null,"Wochenst."]

{"sheet":"VUÜ-PV","index":4,"n_rows":84,"n_cols":8,"rows_kept":84,"cut":false,"hidden":true,"merged":[[48,5,48,7],[3,0,4,1],[22,1,23,1],[37,1,42,1],[46,5,46,7],[47,5,47,7],[3,7,4,7],[43,5,43,7],[9,1,14,1],[3,6,4,6],[3,2,4,2],[3,3,4,3],[3,4,4,4],[3,5,4,5],[22,0,23,0],[31,1,36,1],[56,5,56,7],[59,5,59,7],[50,5,50,7],[51,5,51,7],[49,5,49,7],[78,5,78,7],[79,5,79,7],[69,5,69,7],[73,5,73,7],[74,5,74,7],[76,5,76,7],[70,5,70,7],[71,5,71,7],[72,5,72,7],[75,0,79,0],[6,1,8,1],[6,0,8,0],[9,0,14,0],[15,1,21,1],[75,1,79,1],[15,0,21,0],[28,1,30,1],[59,1,60,1],[59,0,60,0],[45,1,47,1],[54,1,57,1],[54,0,57,0],[45,0,47,0],[31,0,36,0],[51,1,53,1],[51,0,53,0],[48,1,50,1],[66,1,68,1],[69,1,74,1],[69,0,74,0],[66,0,68,0],[61,1,62,1],[61,0,62,0],[25,1,27,1],[28,0,30,0],[25,0,27,0],[37,0,41,0],[48,0,50,0],[43,0,43,1],[44,5,44,7],[45,5,45,7],[62,5,62,7],[75,5,75,7],[67,5,67,7],[68,5,68,7],[63,5,63,7],[66,5,66,7],[61,5,61,7],[52,5,52,7],[53,5,53,7],[54,5,54,7],[55,5,55,7],[60,5,60,7],[58,5,58,7],[57,5,57,7],[86,5,86,7],[63,0,65,0],[63,1,65,1],[64,5,64,7],[65,5,65,7],[80,0,82,0],[80,1,82,1],[80,5,80,7],[81,5,81,7],[77,5,77,7],[82,5,82,7],[83,5,83,7],[84,5,84,7],[83,1,84,1],[83,0,84,0],[85,5,85,7]]}
["Personalveränderungen zum Schuljahr 2019/20 (VUÜ-PV)",null,null,null,null,null,{"$f":"IF(Übersicht!G3<>\"\",Übersicht!G3,\"\")","v":""},"SchNr. FOS"]
["Stand: 09.03.2019",null,null,null,null,null,{"$f":"IF(Übersicht!G4<>\"\",Übersicht!G4,\"\")","v":""},"SchNr. BOS"]
[]
["Personalveränderungen\n(seit 20.10.2018)",null,"Lehrkraft","Fächer"," Stunden-änderung ","Grund","vorauss.   Dauer bis","Stellungnahme d. Schulleitung"]
[]
[1,"Abgänge"]
["1.1","Pensionierung, Krankheit, Tod"]
[]
[]
["1.2","Beurlaub., Muttersch., Elternzeit Anzugeben sind alle Lehrkräfte, deren Berulaubung fortbesteht oder neu beantragt wurde."]
[]
[]
[]
[]
[]
["1.3","geänderte Teilzeit, Sabbatjahr, Ermäßigung\nSeit 20.10.2017 genehmigt oder neu beantragt.\n(nur neue Teilzeitanträge oder Änderungen im Stundenmaß)"]
[]
[]
[]
[]
[]
[]
["1.4","Rückkehr nach Abordnung"]
[]
[2,"Zugänge"]
["2.1","Rückkehr aus Mutterschutz, Elternzeit"]
[]
[]
["2.2","Planstellen zum Schulhalbjahr"]
[]
[]
["2.3","geänderte Teilzeit, \nWegfall Ermäßigung                           Seit 20.10.2018 genehmigt oder neu beantragt.\n(nur Änderungen im Stundenmaß)"]
[]
[]
[]
[]
[]
["2.4","Rückkehr nach Abordnungen    Sämtliche Abordnungen enden mit Ablauf des Schuljahres. Soll eine Abordnung fortbestehen, ist dies unter Nr. 3.2 neu zu vermerken."]
[]
[]
[]
[]
[]
["Vorschläge für 2018/19",null,"Lehrkraft","Fächer","gepl. Std","Vorschläge der Schulleitung"]
[3,"Abbau von Überhängen (Abgänge)"]
["3.1","Versetzungen                                      Auch angeben, wenn kein Überhang besteht. Siehe Vers.antr. vom..."]
[]
[]
["3.2","Abordnungen                                      Mögl. Abordnungen an umliegende berufl. Schulen oder Gymnasien."]
[]
[null,"mögl. Abordnungen an umliegende"]
["3.3","Unterrichtsminderungen                     Nur, wenn Ausgleich im kommenden Jahr möglich ist."]
[]
[]
["3.4","verbleibende Überhänge,                    die nach Ausschöpfung o.g. Möglichkeiten nicht abbaubar erscheinen."]
[]
[]
[]
["4","Deckung von offenem Bedarf (Zugänge)"]
["4.1","Versetzungen                                      Siehe Versetzungsantrag vom......"]
[]
["4.2","Rückkehr aus Beurlaubung"]
[]
["4.3","Abordnungen"]
[]
[]
["4.4","Unterichtsmehrungen                         Nur, wenn Ausgleich im kommenden Jahr möglich ist."]
[]
[]
["4.5","Aushilfsverträge                                  Lehrkräfte, die die Schule weiterbeschäftigen möchte (nur mit Aushilfsgrund !)."]
[]
[]
[]
[]
[]
["4.6","Neueinstellungen                                Nur bei dauerhaftem Bedarf!"]
[]
[]
[]
[]
["4.7","Zuweisung von Referendaren\n(auch zum 2. Schulhalbjahr z.B. aufgrund von Pensionierung oder ATZ)"]
[]
[]
["5","Mobile Reserve"]

{"sheet":"Rechenblatt","index":5,"n_rows":151,"n_cols":153,"rows_kept":151,"cut":false,"hidden":true,"merged":[[108,7,108,12],[108,15,108,20],[75,2,75,3],[75,4,75,5],[75,6,75,7],[75,8,75,9]]}
["Bedarfsberechnung für die Schule"]
[null,null,null,null,"FOS","BOS"]
["Standort:",null,{"$f":"Übersicht!#REF!","v":{"$error":"#REF!"}},null,{"$f":"Übersicht!G3","v":0},{"$f":"Übersicht!G4","v":0}]
[null,null,null,null,null,null,null,null,null,null,null,"Mit Mindestschülerzahlen"]
["Voraussichtliche Schülerzahlen (nach VUÜ-SK)",null,null,null,null,null,null,null,null,null,null,"Anwendung der Mindestschülerzahlen"]
["FOS","T","W","S","G","A","IW","GP","insg",null,null,"FOS","T","W","S","G","A","IW","GP","insg",null,null,null,null,null,null,null,null,"Mindestschülerzahlalgorithmus (VK-12)"]
["Vorkurs",null,null,null,null,null,null,null,{"$f":"'VUÜ-SK'!E20","v":0},null,null,"Vorkurs",null,null,null,null,null,null,null,{"$f":"IF(I7<Parameter!J39,0,I7)","v":0},{"$f":"Parameter!J39","v":0},"Mindestschülerzahl 12",null,null,null,null,null,null,"Sofern (insgesamt) unter 2*8 = 16 > KEINE Budgetschüler"]
["Vorklasse",null,null,null,null,null,null,null,{"$f":"'VUÜ-SK'!E14","v":0},null,null,"Vorklasse",null,null,null,null,null,null,null,{"$f":"IF(I8<Parameter!K39,0,I8)","v":0},{"$f":"Parameter!K39","v":0},"Mindestschülerzahl 15",null,null,null,null,null,null,"Solange noch eine ABR < 8"]
["FOS 11",{"$f":"'VUÜ-SK'!F14","v":0},{"$f":"'VUÜ-SK'!G14","v":0},{"$f":"'VUÜ-SK'!H14","v":0},{"$f":"'VUÜ-SK'!I14","v":0},{"$f":"'VUÜ-SK'!J14","v":0},{"$f":"'VUÜ-SK'!K14","v":0},{"$f":"'VUÜ-SK'!L14","v":0},{"$f":"SUM(B9:H9)","v":0},null,null,"FOS 11",{"$f":"B9:H11","v":0},0,0,0,0,0,0,{"$f":"SUM(M9:S9)","v":0},"Mindestschülerzahlalgorithmus (je Abr 8, insgesamt mind. 2x8)",null,null,null,null,null,null,null,null,"nulle die/eine kleinste ABR aus"]
["FOS 12",{"$f":"'VUÜ-SK'!N14","v":0},{"$f":"'VUÜ-SK'!O14","v":0},{"$f":"'VUÜ-SK'!P14","v":0},{"$f":"'VUÜ-SK'!Q14","v":0},{"$f":"'VUÜ-SK'!R14","v":0},{"$f":"'VUÜ-SK'!S14","v":0},{"$f":"'VUÜ-SK'!T14","v":0},{"$f":"SUM(B10:H10)","v":0},null,null,"FOS 12",0,0,0,0,0,0,0,{"$f":"SUM(M10:S10)","v":0},"Mindestschülerzahlalgorithmus (je Abr 8, insgesamt mind. 2x8)",null,null,null,null,null,null,null,null,"verteile diese Schüler proportional nach SZ auf die anderen ABR"]
["FOS 13",{"$f":"'VUÜ-SK'!V14","v":0},{"$f":"'VUÜ-SK'!W14","v":0},{"$f":"'VUÜ-SK'!X14","v":0},{"$f":"'VUÜ-SK'!Y14","v":0},{"$f":"'VUÜ-SK'!Z14","v":0},{"$f":"'VUÜ-SK'!AA14","v":0},{"$f":"'VUÜ-SK'!AB14","v":0},{"$f":"SUM(B11:H11)","v":0},null,null,"FOS 13",0,0,0,0,0,0,0,{"$f":"SUM(M11:S11)","v":0},"Nullsetzen bei unter 8 Schülern in FOS13+BOS13; Shuffling unter 8",null,null,null,null,null,null,null,"Wend"]
["zusammen",{"$f":"SUM(B7:B11)","v":0},0,0,0,0,0,0,0,null,null,"zusammen",{"$f":"SUM(M7:M11)","v":0},0,0,0,0,0,0,0]
[]
["BOS","T","W","S","x","A","IW","GP","insg",null,null,"BOS","T","W","S","x","A","IW","GP","insg"]
["Vorkurs",null,null,null,0,null,null,null,{"$f":"'VUÜ-SK'!E55","v":0},null,null,"Vorkurs",null,null,null,0,null,null,null,{"$f":"IF(I15<Parameter!J40,0,I15)","v":0},null,"Mindestschülerzahl 12",null,null,null,null,null,null,null,null,null,null,null,null,null,null,null,null,null,null,null,null,null,null,null,null,null,null,null,null,null,null,null,null,{"$f":"MATCH(BC25,$C$25:$I$25,0)","v":1},{"$f":"MATCH(BD25,$C$25:$I$25,0)","v":5},null,{"$f":"MATCH(BF25,$C$25:$I$25,0)","v":1},5,2,4,4,2,6,4]
["Vorklasse",null,null,null,0,null,null,null,{"$f":"'VUÜ-SK'!M49","v":0},null,null,"Vorklasse",null,null,null,0,null,null,null,{"$f":"IF(I16<Parameter!K40,0,I16)","v":0},null,"Mindestschülerzahl 12",null,null,null,null,null,null,null,null,null,null,null,null,null,null,null,null,null,null,null,null,null,null,null,null,null,null,null,null,null,null,null,null,"Phy/Che-Ü","Bio/Che-Pr",null,"Technologie","Technologie","Informatik","Gest-Praxis","Medien","Naturw","Naturw","Naturw","zusätzliche Nat-MK-Teilung"]
["BOS 12",{"$f":"'VUÜ-SK'!N49","v":0},{"$f":"'VUÜ-SK'!O49","v":0},{"$f":"'VUÜ-SK'!P49","v":0},0,{"$f":"'VUÜ-SK'!R49","v":0},{"$f":"'VUÜ-SK'!S49","v":0},{"$f":"'VUÜ-SK'!T49","v":0},{"$f":"SUM(B17:H17)","v":0},null,null,"BOS 12",{"$f":"B17:H20","v":0},0,0,0,0,0,0,{"$f":"SUM(M17:S17)","v":0},"Mindestschülerzahlalgorithmus (je Abr 8, insgesamt mind. 2x8)",null,null,null,null,null,null,null,null,null,null,null,null,null,null,null,null,null,null,null,null,null,null,null,null,null,null,null,null,null,null,null,null,"11",2,2,null,2,0,0,3,2,0,{"$f":"BK17","v":0},0]
["BOS 12/1",{"$f":"'VUÜ-SK'!E49","v":0},{"$f":"'VUÜ-SK'!F49","v":0},null,0,null,null,null,{"$f":"SUM(B18:H18)","v":0},null,null,"BOS 12/1",0,0,0,0,0,0,0,{"$f":"SUM(M18:S18)","v":0},"Mindestschülerzahlalgorithmus (je Abr 8, insgesamt mind. 2x8)",null,null,null,null,null,null,null,null,null,null,null,null,null,null,null,null,null,null,null,null,null,null,null,null,null,null,null,null,null,null,null,null,"12",0,0,null,0,0,2,5,2,2,2,2]
["BOS 12/2",{"$f":"'VUÜ-SK'!H49","v":0},{"$f":"'VUÜ-SK'!I49","v":0},null,0,null,null,null,0,null,null,"BOS 12/2",0,0,0,0,0,0,0,0,"ohne Beschränkungen",null,null,null,null,null,null,null,null,null,null,null,null,null,null,null,null,null,null,null,null,null,null,null,null,null,null,null,null,null,null,null,null,"13",0,0,null,0,0,0,0,3,2,2,2]
["BOS 13",{"$f":"'VUÜ-SK'!V49","v":0},{"$f":"'VUÜ-SK'!W49","v":0},{"$f":"'VUÜ-SK'!X49","v":0},0,{"$f":"'VUÜ-SK'!Z49","v":0},{"$f":"'VUÜ-SK'!AA49","v":0},{"$f":"'VUÜ-SK'!AB49","v":0},{"$f":"SUM(B20:H20)","v":0},null,null,"BOS 13",0,0,0,0,0,0,0,{"$f":"SUM(M20:S20)","v":0},"Nullsetzen bei unter 8 Schülern in FOS13+BOS13; Shuffling unter 8",null,null,null,null,null,null,null,null,null,null,null,null,null,null,null,null,null,null,null,null,null,null,null,null,null,null,null,null,null,null,null,null,"Anteil",1,1,null,0.5,0.5,0.5,0.5,0.5,0,0,0]
["zusammen",{"$f":"SUM(B15:B20)","v":0},{"$f":"SUM(C15:C20)","v":0},{"$f":"SUM(D15:D20)","v":0},0,{"$f":"SUM(F15:F20)","v":0},{"$f":"SUM(G15:G20)","v":0},{"$f":"SUM(H15:H20)","v":0},{"$f":"SUM(I15:I20)","v":0},null,null,"zusammen",{"$f":"SUM(M15:M20)","v":0},{"$f":"SUM(N15:N20)","v":0},{"$f":"SUM(O15:O20)","v":0},0,{"$f":"SUM(Q15:Q20)","v":0},{"$f":"SUM(R15:R20)","v":0},{"$f":"SUM(S15:S20)","v":0},{"$f":"SUM(T15:T20)","v":0}]
[null,null,null,null,null,null,null,null,null,null,null,null,null,null,null,null,null,null,null,null,null,null,null,null,null,null,null,null,null,null,null,null,null,null,null,null,null,null,null,null,null,null,null,null,null,null,null,null,null,null,null,null,null,null,null,null,null,null,null,null,null,null,null,null,null,null,null,null,null,"Sportklassen",null,null,null,null,null,null,null,null,null,null,"Religion/Ethik-Gruppenbildung",null,null,null,null,null,{"$f":"IF(CI27:CL27>=5,1,CI27:CL27/5)","v":0},0,0,0,{"$f":"SUMPRODUCT(IF(CI27:CL27>=Parameter!$J$37,1,CI27:CL27/Parameter!$J$37)*CN27:CQ27)","v":0},null,null,null,null,null,null,null,{"$f":"Parameter!J37","v":5},null,null,"Block 3",null,null,null,null,null,null,null,null,null,null,null,null,null,null,null,null,null,null,null,null,null,null,null,null,null,null,null,null,null,null,null,null,null,"Religionsgruppen FOS13+BOS13",null,null,null,null,null,null,null,null,null,null,null,null,null,null,"Förderunterricht"]
["Klassenbildung",null,null,null,null,null,null,null,null,null,null,null,null,null,null,null,null,null,null,null,null,{"$f":"restschueler(C28:I28,L24:N24,K28,symmetrie)","v":0},0,0,0,0,0,0,null,null,null,null,null,null,null,null,null,null,null,null,null,null,null,null,null,null,null,null,null,null,null,null,null,"Teilungsstunden in Block 2",null,null,null,null,null,null,null,null,null,null,null,null,null,null,null,null,"Bedarf",null,2,{"$f":"Parameter!J36","v":12},null,null,null,null,null,null,null,null,"Quoten",null,null,null,"Projektion (S)",null,null,null,null,{"$f":"Parameter!J37","v":5},null,null,null,null,null,null,null,null,null,"gerundete Klassendurchschnitte",null,null,null,null,null,null,null,"Ergänzungsunterricht (Faktoren für eine Klasse)",null,null,null,null,null,null,null,null,null,null,null,null,"Differenzierungen"]
[null,null,"Schülerzahlen",null,null,null,null,null,null,null,null,11,0,0,null,null,null,null,null,null,null,"Restschüler",null,null,null,null,null,null,"Restklassen",null,null,null,null,null,null,null,null,null,"Mischklassen mit Doppelzählung",null,null,null,null,null,null,"2-Schiene-Modell (Gruppen)",null,null,null,null,null,null,null,null,{"$f":"SUM(BC27:BC30)","v":0},{"$f":"SUM(BD27:BD30)","v":0},null,{"$f":"SUM(BF27:BF30)","v":0},{"$f":"SUM(BG27:BG30)","v":0},0,0,0,0,0,0,0,0,0,null,null,{"$f":"SUM(BS26:BS30)","v":0},0,0,0,0,0,0,0,{"$f":"SUM(CA26:CA30)","v":0},null,null,{"$f":"SUM(CD26:CD30)","v":0},null,null,null,null,{"$f":"SUM(CI26:CI30)","v":0},{"$f":"SUM(CJ26:CJ30)","v":0},0,0,null,0,0,0,0,0,0,0,0,null,null,null,null,null,null,null,null,null,null,null,null,null,null,null,null,null,null,"amin","pmin",{"$f":"SUM(DP26:DP30)","v":0},{"$f":"SUM(DQ26:DQ30)","v":0},{"$f":"ROUNDUP(DQ24,0)","v":0},null,null,null,null,null,null,null,null,{"$f":"SUM(EA26:EA30)","v":0},{"$f":"SUM(EB26:EB30)","v":0},{"$f":"ROUNDUP(EB24,0)","v":0},{"$f":"SUM(ED26:ED30)","v":0},{"$f":"ROUNDUP(ED24,0)","v":0}]
["FOS","Jgst","T","W","S","G","A","IW","GP","Schüler","Teiler","Misch1","Misch2","Misch3","Misch","MK1-I","MK1-II","MK2-I","MK2-II","MK3-I","MK3-II","T","W","S","G","A","IW","GP","T","W","S","G","A","IW","GP","MK","Stdtfl","Klassen","T","W","S","G","A","IW","GP","T","W","S","G","A","IW","GP","STD*","FOS","T","A",null,"T","A","W","G","G","W","IW","G","W","IW","G",null,"FOS","S","3","4","m","w","mw","SpoKla","Klassen","Zusatz","Stdtfl","FOS","Schüler","rk","ev","sonst","Ethik","rk","ev","sonst","Ethik","Teiler","rk","ev","sonst","Ethik","Ethik","Gruppen","Klassen","RU/EU","Stdtfl",null,"T","W","S","G","A","IW","GP","MK/VK","T","W","S","G","A","IW","GP","MK/VK","Mind.","Mind.","ErgUnt","mit Faktor","ganzz","T","W","S","G","A","IW","GP","MK/VK","Diff","mit Faktor","ganzz","WU","ganzz","Schüler","rk","ev","sonst","Ethik","Teiler","rk","ev","sonst","Ethik","Ethik","Gruppen","LWS",null,null,null,"FöU","FöU-Teil"]
["Vorkurs","VK",null,null,null,null,null,null,null,{"$f":"'VUÜ-SK'!E20","v":0},{"$f":"Parameter!K18","v":32},null,null,null,null,null,null,null,null,null,null,null,null,null,null,null,null,null,null,null,null,null,null,null,null,null,{"$f":"AL26*Vorkurs_FOS","v":0},{"$f":"IF(J26<Parameter!J39,0,ROUNDUP(J26/Parameter!K18,0))","v":0},null,null,null,null,null,null,null,null,null,null,null,null,null,null,{"$f":"MIN(J26,DN26)/DN26*AK26","v":0},"Vorkurs",null,null,null,null,null,null,null,null,null,null,null,null,null,null,null,"Vorkurs",null,null,null,null,null,null,null,null,null,null,"Vorkurs",null,null,null,null,null,null,null,null,null,null,null,null,null,null,null,null,null,null,null,{"$f":"B26","v":"VK"},null,null,null,null,null,null,null,null,{"$f":"VLOOKUP(CX26,block3,2,FALSE)","v":0},0,0,0,0,0,0,0,12,null,null,null,null,{"$f":"VLOOKUP(CX26,block3,3,FALSE)","v":0},0,0,0,0,0,0,0,null,null,null,null,null,null,null,null,null,null,null,null,null,null,null,null,null,null,null,null,{"$f":"B26","v":"VK"}]
["Vorklasse","VS",null,null,null,null,null,null,null,{"$f":"'VUÜ-SK'!E14","v":0},{"$f":"Parameter!J18","v":30},null,null,null,null,null,null,null,null,null,null,null,null,null,null,null,null,null,null,null,null,null,null,null,null,{"$f":"AL27","v":0},{"$f":"AL27*Vorklasse_FOS","v":0},{"$f":"ROUNDUP(J27/Parameter!J18,0)","v":0},null,null,null,null,null,null,null,null,null,null,null,null,null,null,{"$f":"MIN(J27,DN27)/DN27*AK27","v":0},"Vorklasse",null,null,null,null,null,null,null,null,null,null,null,null,null,null,null,"Vorklasse",null,null,null,null,null,null,null,null,null,null,"Vorklasse",{"$f":"J27","v":0},{"$f":"IF(SUM('VUÜ-Budget'!$G$30:$J$30)=0,Parameter!X7,'VUÜ-Budget'!G30/SUM('VUÜ-Budget'!$G30:$J30))","v":0.46179587283881762},{"$f":"IF(SUM('VUÜ-Budget'!$G$30:$J$30)=0,Parameter!Y7,'VUÜ-Budget'!H30/SUM('VUÜ-Budget'!$G30:$J30))","v":0.20398773006134968},{"$f":"IF(SUM('VUÜ-Budget'!$G$30:$J$30)=0,Parameter!Z7,'VUÜ-Budget'!I30/SUM('VUÜ-Budget'!$G30:$J30))","v":9.295408068414203E-5},{"$f":"IF(SUM('VUÜ-Budget'!$G$30:$J$30)=0,Parameter!AA7,'VUÜ-Budget'!J30/SUM('VUÜ-Budget'!$G30:$J30))","v":0.33412344301914854},{"$f":"CD27-SUM(CJ27:CL27)","v":0},{"$f":"ROUND($CD27*CF27,0)","v":0},{"$f":"ROUND($CD27*CG27,0)","v":0},{"$f":"ROUND($CD27*CH27,0)","v":0},{"$f":"TRANSPOSE(Parameter!O18:R18)","v":28},{"$f":"ROUNDUP(CI27/$CM27,0)","v":0},{"$f":"ROUNDUP(CJ27/$CM27,0)","v":0},{"$f":"ROUNDUP(CK27/$CM27,0)","v":0},{"$f":"ROUNDUP(CL27/$CM27,0)","v":0},null,{"$f":"SUM(CN27:CQ27)","v":0},{"$f":"AL27","v":0},{"$f":"SUMPRODUCT(IF(CI27:CL27>=Parameter!$J$37,1,CI27:CL27/Parameter!$J$37)*(CN27:CQ27))*CV27","v":0},{"$f":"Stundentafel!V55","v":1},{"$f":"B27","v":"VS"},null,null,null,null,null,null,null,{"$f":"ROUND(IF(AL27=0,0,J27/AL27),0)","v":0},0,0,0,0,0,0,0,{"$f":"IF(AND(AL27=1,DE27<DN27),0,VLOOKUP(DE27,block3,2,FALSE))","v":0},15,null,{"$f":"SUMPRODUCT(AC27:AJ27,DF27:DM27)*IF(AJ27>1,1,MIN(DE27,DN27)/DN27)","v":0},{"$f":"HLOOKUP(B27,Parameter!$A$70:$G$72,2,FALSE)*DP27","v":0},{"$f":"IF(DR$24=0,0,ROUND(DQ27/DQ$24*DR$24,0))","v":0},0,0,0,0,0,0,0,{"$f":"IF(AND(AL27=1,DE27<DN27),0,VLOOKUP(DE27,block3,3,FALSE))","v":0},{"$f":"SUMPRODUCT(AC27:AJ27,DS27:DZ27)*IF(AJ27>1,1,MIN(DE27,DN27)/DN27)","v":0},{"$f":"HLOOKUP(B27,Parameter!$A$70:$G$72,3,FALSE)*EA27","v":0},{"$f":"IF(EC$24=0,0,ROUND(EB27/EB$24*EC$24,0))","v":0},{"$f":"I8*Stundentafel!$S$2*Parameter!J71","v":0},{"$f":"IF(EE$24=0,0,ROUND(ED27/ED$24*EE$24,0))","v":0},null,null,null,null,null,null,null,null,null,null,null,null,null,null,null,{"$f":"B27","v":"VS"}]
["FOS 11","11",{"$f":"M9:S11","v":0},0,0,0,0,0,0,{"$f":"SUM(C28:I28)","v":0},{"$f":"Parameter!L18","v":28},{"$f":"klassen(C28:I28,K28,Stundentafel!B6:AX6,tiefe,symmetrie)","v":0},0,0,{"$f":"COUNTIF(L28:N28,\">0\")","v":0},{"$f":"VLOOKUP(L28,mischklassen,6,FALSE)","v":0},{"$f":"VLOOKUP(L28,mischklassen,7,FALSE)","v":0},{"$f":"VLOOKUP(M28,mischklassen,6,FALSE)","v":0},{"$f":"VLOOKUP(M28,mischklassen,7,FALSE)","v":0},{"$f":"VLOOKUP(N28,mischklassen,6,FALSE)","v":0},{"$f":"VLOOKUP(N28,mischklassen,7,FALSE)","v":0},{"$f":"restschueler(C28:I28,L28:N28,K28,symmetrie)","v":0},0,0,0,0,0,0,{"$f":"ROUNDUP(V28/$K28,0)","v":0},{"$f":"ROUNDUP(W28/$K28,0)","v":0},0,0,0,0,0,{"$f":"O28","v":0},{"$f":"gesstunden(V28:AB28,L28:N28,K28,Stundentafel!B6:AX6)","v":0},{"$f":"SUM(AC28:AI28,O28)","v":0},{"$f":"COUNTIF($P28:$U28,AM$25)","v":0},{"$f":"COUNTIF($P28:$U28,AN$25)","v":0},0,0,0,0,0,{"$f":"zweischienen(C28,V28,AC28,AM28,Parameter!$J$34)","v":0},{"$f":"zweischienen(D28,W28,AD28,AN28,Parameter!$J$34)","v":0},{"$f":"zweischienen(E28,X28,AE28,AO28,Parameter!$J$34)","v":0},{"$f":"zweischienen(F28,Y28,AF28,AP28,Parameter!$J$34)","v":0},{"$f":"zweischienen(G28,Z28,AG28,AQ28,Parameter!$J$34)","v":0},{"$f":"zweischienen(H28,AA28,AH28,AR28,Parameter!$J$34)","v":0},{"$f":"zweischienen(I28,AB28,AI28,AS28,Parameter!$J$34)","v":0},{"$f":"budget(C28:I28,L28:N28,K28,symmetrie,Stundentafel!C100:AY100,Stundentafel!C106:AY106,Stundentafel!C112:AY112,DN28,DO28)","v":0},"11",{"$f":"(INDEX($AT28:$AZ28,BC$15)-SUM(INDEX($AC28:$AI28,BC$15),INDEX($AM28:$AS28,BC$15)))*IF($BB28=\"VS\",0,INDEX(BC$17:BC$19,VALUE($BB28)-10))","v":0},{"$f":"(INDEX($AT28:$AZ28,BD$15)-SUM(INDEX($AC28:$AI28,BD$15),INDEX($AM28:$AS28,BD$15)))*IF($BB28=\"VS\",0,INDEX(BD$17:BD$19,VALUE($BB28)-10))","v":0},null,{"$f":"IF(IF(INDEX($AC28:$AI28,BF$15)=0,0,INDEX($V28:$AB28,BF$15)/INDEX($AC28:$AI28,BF$15))>=Parameter!$J$35,BF$20*INDEX($AC28:$AI28,BF$15)*IF($BB28=\"VS\",0,INDEX(BF$17:BF$19,VALUE($BB28)-10)),0)","v":0},{"$f":"IF(IF(INDEX($AC28:$AI28,BG$15)=0,0,INDEX($V28:$AB28,BG$15)/INDEX($AC28:$AI28,BG$15))>=Parameter!$J$35,BG$20*INDEX($AC28:$AI28,BG$15)*IF($BB28=\"VS\",0,INDEX(BG$17:BG$19,VALUE($BB28)-10)),0)","v":0},{"$f":"IF(IF(INDEX($AC28:$AI28,BH$15)=0,0,INDEX($V28:$AB28,BH$15)/INDEX($AC28:$AI28,BH$15))>=Parameter!$J$35,BH$20*INDEX($AC28:$AI28,BH$15)*IF($BB28=\"VS\",0,INDEX(BH$17:BH$19,VALUE($BB28)-10)),0)","v":0},{"$f":"IF(IF(INDEX($AC28:$AI28,BI$15)=0,0,INDEX($V28:$AB28,BI$15)/INDEX($AC28:$AI28,BI$15))>=Parameter!$J$35,BI$20*INDEX($AC28:$AI28,BI$15)*IF($BB28=\"VS\",0,INDEX(BI$17:BI$19,VALUE($BB28)-10)),0)","v":0},{"$f":"IF(IF(INDEX($AC28:$AI28,BJ$15)=0,0,INDEX($V28:$AB28,BJ$15)/INDEX($AC28:$AI28,BJ$15))>=Parameter!$J$35,BJ$20*INDEX($AC28:$AI28,BJ$15)*IF($BB28=\"VS\",0,INDEX(BJ$17:BJ$19,VALUE($BB28)-10)),0)","v":0},{"$f":"IF(IF(INDEX($AC28:$AI28,BK$15)=0,0,INDEX($V28:$AB28,BK$15)/INDEX($AC28:$AI28,BK$15))>=Parameter!$J$35,BK$20*INDEX($AC28:$AI28,BK$15)*IF($BB28=\"VS\",0,INDEX(BK$17:BK$19,VALUE($BB28)-10)),0)","v":0},{"$f":"IF(IF(INDEX($AC28:$AI28,BL$15)=0,0,INDEX($V28:$AB28,BL$15)/INDEX($AC28:$AI28,BL$15))>=Parameter!$J$35,BL$20*INDEX($AC28:$AI28,BL$15)*IF($BB28=\"VS\",0,INDEX(BL$17:BL$19,VALUE($BB28)-10)),0)","v":0},{"$f":"IF(IF(INDEX($AC28:$AI28,BM$15)=0,0,INDEX($V28:$AB28,BM$15)/INDEX($AC28:$AI28,BM$15))>=Parameter!$J$35,BM$20*INDEX($AC28:$AI28,BM$15)*IF($BB28=\"VS\",0,INDEX(BM$17:BM$19,VALUE($BB28)-10)),0)","v":0},{"$f":"(IF(AND(OR($P28=\"G\",$P28=\"W\",$P28=\"IW\"),OR($Q28=\"G\",$Q28=\"W\",$Q28=\"IW\")),IF($P28=BN$25,0.5,0)+IF($Q28=BN$25,0.5,0),0)+IF(AND(OR($R28=\"G\",$R28=\"W\",$R28=\"IW\"),OR($S28=\"G\",$S28=\"W\",$S28=\"IW\")),IF($R28=BN$25,0.5,0)+IF($S28=BN$25,0.5,0),0)+IF(AND(OR($T28=\"G\",$T28=\"W\",$T28=\"IW\"),OR($U28=\"G\",$U28=\"W\",$U28=\"IW\")),IF($T28=BN$25,0.5,0)+IF($U28=BN$25,0.5,0),0))*IF($BB28=\"VS\",0,INDEX(BK$17:BK$19,VALUE(LEFT($BB28,2))-10))*BK$20","v":0},0,0,null,"11",null,null,null,null,null,null,null,null,null,null,"11",null,null,null,null,null,null,null,null,null,28,null,null,null,null,null,null,null,null,{"$f":"Stundentafel!V56","v":0},"11",{"$f":"IF(AC28=0,0,ROUND(V28/AC28,0))","v":0},{"$f":"IF(AD28=0,0,ROUND(W28/AD28,0))","v":0},{"$f":"IF(AE28=0,0,ROUND(X28/AE28,0))","v":0},{"$f":"IF(AF28=0,0,ROUND(Y28/AF28,0))","v":0},{"$f":"IF(AG28=0,0,ROUND(Z28/AG28,0))","v":0},{"$f":"IF(AH28=0,0,ROUND(AA28/AH28,0))","v":0},{"$f":"IF(AI28=0,0,ROUND(AB28/AI28,0))","v":0},{"$f":"ROUND(IF(O28=0,0,(J28-SUM(V28:AB28))/O28),0)","v":0},{"$f":"IF(AND(AC28=1,CX28<$DN28),0,VLOOKUP(CX28,block3,2,FALSE))","v":0},0,0,0,0,0,0,{"$f":"IF(AND(DE28<$DN28),0,VLOOKUP(DE28,block3,2,FALSE))","v":0},16,16,{"$f":"SUMPRODUCT((AC28:AJ28)*(DF28:DM28)*IF(OR((AC28:AJ28)>1,CX28:DE28)>=DN28,1,CX28:DE28/DN28))","v":0},{"$f":"HLOOKUP(B28,Parameter!$A$70:$G$72,2,FALSE)*DP28","v":0},{"$f":"IF(DR$24=0,0,ROUND(DQ28/DQ$24*DR$24,0))","v":0},{"$f":"IF(AND(AC28=1,CX28<$DN28),0,VLOOKUP(CX28,block3,3,FALSE))","v":0},0,0,0,0,0,0,{"$f":"IF(AND(DE28<$DN28),0,VLOOKUP(DE28,block3,3,FALSE))","v":0},{"$f":"SUMPRODUCT((AC28:AJ28)*(DS28:DZ28)*IF(OR((AC28:AJ28)>1,CX28:DE28>=DN28),1,CX28:DE28/DN28))","v":0},{"$f":"HLOOKUP(B28,Parameter!$A$70:$G$72,3,FALSE)*EA28","v":0},{"$f":"IF(EC$24=0,0,ROUND(EB28/EB$24*EC$24,0))","v":0},{"$f":"I9*Stundentafel!$S$2*Parameter!J72","v":0},{"$f":"IF(EE$24=0,0,ROUND(ED28/ED$24*EE$24,0))","v":0},null,null,null,null,null,null,null,null,null,null,null,null,null,null,null,{"$f":"B28","v":"11"},{"$f":"budget(C28:I28,L28:N28,K28,symmetrie,Stundentafel!C104:AY104,Stundentafel!C110:AY110,Stundentafel!C116:AY116,16,16)","v":0},{"$f":"ges_privat_teilung(C28:I28,L28:N28,K28,symmetrie,Stundentafel!B10:AX10,16)","v":0}]
["FOS 12","12",0,0,0,0,0,0,0,{"$f":"SUM(C29:I29)","v":0},{"$f":"Parameter!M18","v":25},{"$f":"klassen(C29:I29,K29,Stundentafel!B7:AX7,tiefe,symmetrie)","v":0},0,0,{"$f":"COUNTIF(L29:N29,\">0\")","v":0},{"$f":"VLOOKUP(L29,mischklassen,6,FALSE)","v":0},{"$f":"VLOOKUP(L29,mischklassen,7,FALSE)","v":0},{"$f":"VLOOKUP(M29,mischklassen,6,FALSE)","v":0},{"$f":"VLOOKUP(M29,mischklassen,7,FALSE)","v":0},{"$f":"VLOOKUP(N29,mischklassen,6,FALSE)","v":0},{"$f":"VLOOKUP(N29,mischklassen,7,FALSE)","v":0},{"$f":"restschueler(C29:I29,L29:N29,K29,symmetrie)","v":0},0,0,0,0,0,0,{"$f":"ROUNDUP(V29/$K29,0)","v":0},0,0,0,0,0,0,{"$f":"O29","v":0},{"$f":"gesstunden(V29:AB29,L29:N29,K29,Stundentafel!B7:AX7)","v":0},{"$f":"SUM(AC29:AI29,O29)","v":0},{"$f":"COUNTIF($P29:$U29,AM$25)","v":0},0,0,0,0,0,0,{"$f":"zweischienen(C29,V29,AC29,AM29,Parameter!$J$34)","v":0},{"$f":"zweischienen(D29,W29,AD29,AN29,Parameter!$J$34)","v":0},{"$f":"zweischienen(E29,X29,AE29,AO29,Parameter!$J$34)","v":0},{"$f":"zweischienen(F29,Y29,AF29,AP29,Parameter!$J$34)","v":0},{"$f":"zweischienen(G29,Z29,AG29,AQ29,Parameter!$J$34)","v":0},{"$f":"zweischienen(H29,AA29,AH29,AR29,Parameter!$J$34)","v":0},{"$f":"zweischienen(I29,AB29,AI29,AS29,Parameter!$J$34)","v":0},{"$f":"budget(C29:I29,L29:N29,K29,symmetrie,Stundentafel!C101:AY101,Stundentafel!C107:AY107,Stundentafel!C113:AY113,DN29,DO29)","v":0},"12",0,0,null,{"$f":"IF(IF(INDEX($AC29:$AI29,BF$15)=0,0,INDEX($V29:$AB29,BF$15)/INDEX($AC29:$AI29,BF$15))>=Parameter!$J$35,BF$20*INDEX($AC29:$AI29,BF$15)*IF($BB29=\"VS\",0,INDEX(BF$17:BF$19,VALUE($BB29)-10)),0)","v":0},{"$f":"IF(IF(INDEX($AC29:$AI29,BG$15)=0,0,INDEX($V29:$AB29,BG$15)/INDEX($AC29:$AI29,BG$15))>=Parameter!$J$35,BG$20*INDEX($AC29:$AI29,BG$15)*IF($BB29=\"VS\",0,INDEX(BG$17:BG$19,VALUE($BB29)-10)),0)","v":0},{"$f":"IF(IF(INDEX($AC29:$AI29,BH$15)=0,0,INDEX($V29:$AB29,BH$15)/INDEX($AC29:$AI29,BH$15))>=Parameter!$J$35,BH$20*INDEX($AC29:$AI29,BH$15)*IF($BB29=\"VS\",0,INDEX(BH$17:BH$19,VALUE($BB29)-10)),0)","v":0},{"$f":"IF(IF(INDEX($AC29:$AI29,BI$15)=0,0,INDEX($V29:$AB29,BI$15)/INDEX($AC29:$AI29,BI$15))>=Parameter!$J$35,BI$20*INDEX($AC29:$AI29,BI$15)*IF($BB29=\"VS\",0,INDEX(BI$17:BI$19,VALUE($BB29)-10)),0)","v":0},{"$f":"IF(IF(INDEX($AC29:$AI29,BJ$15)=0,0,INDEX($V29:$AB29,BJ$15)/INDEX($AC29:$AI29,BJ$15))>=Parameter!$J$35,BJ$20*INDEX($AC29:$AI29,BJ$15)*IF($BB29=\"VS\",0,INDEX(BJ$17:BJ$19,VALUE($BB29)-10)),0)","v":0},{"$f":"IF(IF(INDEX($AC29:$AI29,BK$15)=0,0,INDEX($V29:$AB29,BK$15)/INDEX($AC29:$AI29,BK$15))>=Parameter!$J$35,BK$20*INDEX($AC29:$AI29,BK$15)*IF($BB29=\"VS\",0,INDEX(BK$17:BK$19,VALUE($BB29)-10)),0)","v":0},{"$f":"IF(IF(INDEX($AC29:$AI29,BL$15)=0,0,INDEX($V29:$AB29,BL$15)/INDEX($AC29:$AI29,BL$15))>=Parameter!$J$35,BL$20*INDEX($AC29:$AI29,BL$15)*IF($BB29=\"VS\",0,INDEX(BL$17:BL$19,VALUE($BB29)-10)),0)","v":0},{"$f":"IF(IF(INDEX($AC29:$AI29,BM$15)=0,0,INDEX($V29:$AB29,BM$15)/INDEX($AC29:$AI29,BM$15))>=Parameter!$J$35,BM$20*INDEX($AC29:$AI29,BM$15)*IF($BB29=\"VS\",0,INDEX(BM$17:BM$19,VALUE($BB29)-10)),0)","v":0},0,0,0,null,"12",{"$f":"SUM(C29:I29)","v":0},{"$f":"IF('VUÜ-Budget'!D29=0,ROUND(0.5*BS29,0),ROUND('VUÜ-Budget'!B29/'VUÜ-Budget'!D29*BS29,0))","v":0},{"$f":"BS29-BT29","v":0},{"$f":"ROUNDUP(BT29/Parameter!Q18,0)","v":0},{"$f":"ROUNDUP(BU29/Parameter!R18,0)","v":0},0,{"$f":"SUM(BV29:BX29)","v":0},{"$f":"AL29","v":0},{"$f":"SUMPRODUCT(IF(BT29:BU29>=Parameter!$J$36,1,BT29:BU29/Parameter!$J$36)*(BV29:BW29))*CB29","v":0},{"$f":"Stundentafel!W57","v":2},"12",{"$f":"J29","v":0},{"$f":"CE27","v":0.46179587283881762},{"$f":"CF27","v":0.20398773006134968},{"$f":"CG27","v":9.295408068414203E-5},{"$f":"CH27","v":0.33412344301914854},{"$f":"CD29-SUM(CJ29:CL29)","v":0},{"$f":"ROUND($CD29*CF29,0)","v":0},0,0,28,{"$f":"ROUNDUP(CI29/$CM29,0)","v":0},0,0,0,null,{"$f":"SUM(CN29:CQ29)","v":0},{"$f":"AL29","v":0},{"$f":"SUMPRODUCT(IF(CI29:CL29>=Parameter!$J$37,1,CI29:CL29/Parameter!$J$37)*(CN29:CQ29))*CV29","v":0},{"$f":"Stundentafel!V57","v":2},"12",0,0,0,0,0,0,0,{"$f":"ROUND(IF(O29=0,0,(J29-SUM(V29:AB29))/O29),0)","v":0},0,0,0,0,0,0,0,{"$f":"IF(AND(DE29<$DN29),0,VLOOKUP(DE29,block3,2,FALSE))","v":0},16,{"$f":"$DO$28","v":16},{"$f":"SUMPRODUCT((AC29:AJ29)*(DF29:DM29)*IF(OR((AC29:AJ29)>1,CX29:DE29)>=DN29,1,CX29:DE29/DN29))","v":0},{"$f":"HLOOKUP(B29,Parameter!$A$70:$G$72,2,FALSE)*DP29","v":0},{"$f":"IF(DR$24=0,0,ROUND(DQ29/DQ$24*DR$24,0))","v":0},0,0,0,0,0,0,0,{"$f":"IF(AND(DE29<$DN29),0,VLOOKUP(DE29,block3,3,FALSE))","v":0},{"$f":"SUMPRODUCT((AC29:AJ29)*(DS29:DZ29)*IF(OR((AC29:AJ29)>1,CX29:DE29>=DN29),1,CX29:DE29/DN29))","v":0},{"$f":"HLOOKUP(B29,Parameter!$A$70:$G$72,3,FALSE)*EA29","v":0},{"$f":"IF(EC$24=0,0,ROUND(EB29/EB$24*EC$24,0))","v":0},{"$f":"I10*Stundentafel!$S$2*Parameter!J73","v":0},{"$f":"IF(EE$24=0,0,ROUND(ED29/ED$24*EE$24,0))","v":0},null,null,null,null,null,null,null,null,null,null,null,null,null,null,null,{"$f":"B29","v":"12"}]
["FOS 13","13",0,0,0,0,0,0,0,{"$f":"SUM(C30:I30)","v":0},{"$f":"Parameter!N18","v":25},{"$f":"klassen(C30:I30,K30,Stundentafel!B8:AX8,tiefe,symmetrie)","v":0},0,0,{"$f":"COUNTIF(L30:N30,\">0\")","v":0},{"$f":"VLOOKUP(L30,mischklassen,6,FALSE)","v":0},{"$f":"VLOOKUP(L30,mischklassen,7,FALSE)","v":0},{"$f":"VLOOKUP(M30,mischklassen,6,FALSE)","v":0},{"$f":"VLOOKUP(M30,mischklassen,7,FALSE)","v":0},{"$f":"VLOOKUP(N30,mischklassen,6,FALSE)","v":0},{"$f":"VLOOKUP(N30,mischklassen,7,FALSE)","v":0},{"$f":"restschueler(C30:I30,L30:N30,K30,symmetrie)","v":0},0,0,0,0,0,0,0,0,0,0,0,0,0,{"$f":"O30","v":0},{"$f":"gesstunden(V30:AB30,L30:N30,K30,Stundentafel!B8:AX8)","v":0},{"$f":"SUM(AC30:AI30,O30)","v":0},0,0,0,0,0,0,0,{"$f":"zweischienen(C30,V30,AC30,AM30,Parameter!$J$34)","v":0},{"$f":"zweischienen(D30,W30,AD30,AN30,Parameter!$J$34)","v":0},{"$f":"zweischienen(E30,X30,AE30,AO30,Parameter!$J$34)","v":0},{"$f":"zweischienen(F30,Y30,AF30,AP30,Parameter!$J$34)","v":0},{"$f":"zweischienen(G30,Z30,AG30,AQ30,Parameter!$J$34)","v":0},{"$f":"zweischienen(H30,AA30,AH30,AR30,Parameter!$J$34)","v":0},{"$f":"zweischienen(I30,AB30,AI30,AS30,Parameter!$J$34)","v":0},{"$f":"budget(C30:I30,L30:N30,K30,symmetrie,Stundentafel!C102:AY102,Stundentafel!C108:AY108,Stundentafel!C114:AY114,DN30,DO30)","v":0},"13",0,0,null,{"$f":"IF(IF(INDEX($AC30:$AI30,BF$15)=0,0,INDEX($V30:$AB30,BF$15)/INDEX($AC30:$AI30,BF$15))>=Parameter!$J$35,BF$20*INDEX($AC30:$AI30,BF$15)*IF($BB30=\"VS\",0,INDEX(BF$17:BF$19,VALUE($BB30)-10)),0)","v":0},{"$f":"IF(IF(INDEX($AC30:$AI30,BG$15)=0,0,INDEX($V30:$AB30,BG$15)/INDEX($AC30:$AI30,BG$15))>=Parameter!$J$35,BG$20*INDEX($AC30:$AI30,BG$15)*IF($BB30=\"VS\",0,INDEX(BG$17:BG$19,VALUE($BB30)-10)),0)","v":0},{"$f":"IF(IF(INDEX($AC30:$AI30,BH$15)=0,0,INDEX($V30:$AB30,BH$15)/INDEX($AC30:$AI30,BH$15))>=Parameter!$J$35,BH$20*INDEX($AC30:$AI30,BH$15)*IF($BB30=\"VS\",0,INDEX(BH$17:BH$19,VALUE($BB30)-10)),0)","v":0},{"$f":"IF(IF(INDEX($AC30:$AI30,BI$15)=0,0,INDEX($V30:$AB30,BI$15)/INDEX($AC30:$AI30,BI$15))>=Parameter!$J$35,BI$20*INDEX($AC30:$AI30,BI$15)*IF($BB30=\"VS\",0,INDEX(BI$17:BI$19,VALUE($BB30)-10)),0)","v":0},{"$f":"IF(IF(INDEX($AC30:$AI30,BJ$15)=0,0,INDEX($V30:$AB30,BJ$15)/INDEX($AC30:$AI30,BJ$15))>=Parameter!$J$35,BJ$20*INDEX($AC30:$AI30,BJ$15)*IF($BB30=\"VS\",0,INDEX(BJ$17:BJ$19,VALUE($BB30)-10)),0)","v":0},{"$f":"IF(IF(INDEX($AC30:$AI30,BK$15)=0,0,INDEX($V30:$AB30,BK$15)/INDEX($AC30:$AI30,BK$15))>=Parameter!$J$35,BK$20*INDEX($AC30:$AI30,BK$15)*IF($BB30=\"VS\",0,INDEX(BK$17:BK$19,VALUE($BB30)-10)),0)","v":0},{"$f":"IF(IF(INDEX($AC30:$AI30,BL$15)=0,0,INDEX($V30:$AB30,BL$15)/INDEX($AC30:$AI30,BL$15))>=Parameter!$J$35,BL$20*INDEX($AC30:$AI30,BL$15)*IF($BB30=\"VS\",0,INDEX(BL$17:BL$19,VALUE($BB30)-10)),0)","v":0},{"$f":"IF(IF(INDEX($AC30:$AI30,BM$15)=0,0,INDEX($V30:$AB30,BM$15)/INDEX($AC30:$AI30,BM$15))>=Parameter!$J$35,BM$20*INDEX($AC30:$AI30,BM$15)*IF($BB30=\"VS\",0,INDEX(BM$17:BM$19,VALUE($BB30)-10)),0)","v":0},0,0,0,null,"13",null,null,null,null,null,null,null,null,null,null,"13",{"$f":"J30","v":0},{"$f":"IF(SUM('VUÜ-Budget'!$G$29:$J$29)=0,CE29,'VUÜ-Budget'!G29/SUM('VUÜ-Budget'!$G29:$J29))","v":0.46179587283881762},{"$f":"IF(SUM('VUÜ-Budget'!$G$29:$J$29)=0,CF29,'VUÜ-Budget'!H29/SUM('VUÜ-Budget'!$G29:$J29))","v":0.20398773006134968},{"$f":"IF(SUM('VUÜ-Budget'!$G$29:$J$29)=0,CG29,'VUÜ-Budget'!I29/SUM('VUÜ-Budget'!$G29:$J29))","v":9.295408068414203E-5},{"$f":"IF(SUM('VUÜ-Budget'!$G$29:$J$29)=0,CH29,'VUÜ-Budget'!J29/SUM('VUÜ-Budget'!$G29:$J29))","v":0.33412344301914854},{"$f":"CD30-SUM(CJ30:CL30)","v":0},0,0,0,28,0,0,0,0,null,{"$f":"SUM(CN30:CQ30)","v":0},{"$f":"AL30","v":0},{"$f":"SUMPRODUCT(IF(CI30:CL30>=Parameter!$J$37,1,CI30:CL30/Parameter!$J$37)*(CN30:CQ30))*CV30","v":0},{"$f":"Stundentafel!V58","v":1},{"$f":"B30","v":"13"},0,0,0,0,0,0,0,{"$f":"ROUND(IF(O30=0,0,(J30-SUM(V30:AB30))/O30),0)","v":0},0,0,0,0,0,0,0,{"$f":"IF(AND(DE30<$DN30),0,VLOOKUP(DE30,block3,2,FALSE))","v":0},8,{"$f":"DN30","v":8},{"$f":"SUMPRODUCT((AC30:AJ30)*(DF30:DM30)*IF(OR((AC30:AJ30)>1,CX30:DE30)>=DN30,1,CX30:DE30/DN30))","v":0},{"$f":"HLOOKUP(B30,Parameter!$A$70:$G$72,2,FALSE)*DP30","v":0},{"$f":"DR24-SUM(DR27:DR29)","v":0},0,0,0,0,0,0,0,{"$f":"IF(AND(DE30<$DN30),0,VLOOKUP(DE30,block3,3,FALSE))","v":0},{"$f":"SUMPRODUCT((AC30:AJ30)*(DS30:DZ30)*IF(OR((AC30:AJ30)>1,CX30:DE30>=DN30),1,CX30:DE30/DN30))","v":0},{"$f":"HLOOKUP(B30,Parameter!$A$70:$G$72,3,FALSE)*EA30","v":0},{"$f":"EC24-SUM(EC27:EC29)","v":0},{"$f":"I11*Stundentafel!$S$2*Parameter!J74","v":0},{"$f":"EE24-SUM(EE27:EE29)","v":0},{"$f":"SUM(EG30:EJ30)","v":0},{"$f":"CI30+CI40","v":0},{"$f":"CJ30+CJ40","v":0},{"$f":"CK30+CK40","v":0},{"$f":"CL30+CL40","v":0},{"$f":"MAX(CM30,CM40)","v":28},{"$f":"IF(EG30>=Parameter!$J$37,ROUNDUP(EG30/$EK30,0),0)","v":0},{"$f":"IF(EH30>=Parameter!$J$37,ROUNDUP(EH30/$EK30,0),0)","v":0},{"$f":"IF(EI30>=Parameter!$J$37,ROUNDUP(EI30/$EK30,0),0)","v":0},{"$f":"IF(EP30>=Parameter!$J$37,ROUNDUP(EP30/$CM30,0),0)","v":0},{"$f":"SUMPRODUCT((EG30:EI30<Parameter!$J$37)*(EG30:EI30))+EJ30","v":0},{"$f":"SUM(EL30:EO30)","v":0},{"$f":"SUM(EL30:EO30)*VLOOKUP($B$30,Stundentafel!$X$54:$Y$59,2,FALSE)","v":0},null,null,{"$f":"B30","v":"13"}]
[]
[]
[null,null,"Schülerzahlen",null,null,null,null,null,null,null,null,null,null,null,null,null,null,null,null,null,null,"Restschüler",null,null,null,null,null,null,"Restklassen",null,null,null,null,null,null,null,null,null,"Mischklassen mit Doppelzählung",null,null,null,null,null,null,"2-Schiene-Modell (Gruppen)",null,null,null,null,null,null,null,null,{"$f":"SUM(BC36:BC40)","v":0},{"$f":"SUM(BD36:BD40)","v":0},null,{"$f":"SUM(BF36:BF40)","v":0},0,0,0,0,0,0,0,0,0,0,null,null,{"$f":"SUM(BS35:BS40)","v":0},{"$f":"SUM(BT35:BT40)","v":0},0,0,0,0,0,0,0,null,null,{"$f":"SUM(CD35:CD40)","v":0},null,null,null,null,{"$f":"SUM(CI35:CI40)","v":0},{"$f":"SUM(CJ35:CJ40)","v":0},{"$f":"SUM(CK35:CK40)","v":0},{"$f":"SUM(CL35:CL40)","v":0},null,{"$f":"SUM(CN35:CN40)","v":0},0,0,0,0,0,0,0,null,null,null,null,null,null,null,null,null,null,null,null,null,null,null,null,null,null,null,null,{"$f":"SUM(DP35:DP40)","v":0},{"$f":"SUM(DQ35:DQ40)","v":0},{"$f":"ROUNDUP(DQ33,0)","v":0},null,null,null,null,null,null,null,null,{"$f":"SUM(EA35:EA40)","v":0},{"$f":"SUM(EB35:EB40)","v":0},{"$f":"ROUNDUP(EB33,0)","v":0},{"$f":"SUM(ED35:ED40)","v":0},{"$f":"ROUNDUP(ED33,0)","v":0}]
["BOS","Jgst","T","W","S","G","A","IW","GP","Schüler","Teiler","Misch1","Misch2","Misch3","Misch","MK1-I","MK1-II","MK2-I","MK2-II","MK3-I","MK3-II","T","W","S","G","A","IW","GP","T","W","S","G","A","IW","GP","MK","Stdtfl","Klassen","T","W","S","G","A","IW","GP","T","W","S","G","A","IW","GP","STD*","BOS","T","A",null,"T","A","W","G","G","W","IW","G","W","IW","G",null,"BOS","S","3","4","m","w","mw","SpoKla","Klassen","Zusatz",null,"BOS","Schüler","rk","ev","sonst","Ethik","rk","ev","sonst","Ethik","Teiler","rk","ev","sonst","Ethik","Ethik","Gruppen","Klassen","Zuschlag",null,null,"T","W","S","G","A","IW","GP","MK/VK","T","W","S","G","A","IW","GP","MK/VK","Mind.","Mind.","ErgUnt","mit Faktor","ganzz","T","W","S","G","A","IW","GP","MK/VK","Diff","mit Faktor","ganzz","WU","ganzz"]
["Vorkurs","VK",null,null,null,null,null,null,null,{"$f":"'VUÜ-SK'!E55","v":0},{"$f":"Parameter!K19","v":32},null,null,null,null,null,null,null,null,null,null,null,null,null,null,null,null,null,null,null,null,null,null,null,null,null,{"$f":"Vorkurs_BOS*AL35","v":0},{"$f":"IF(J35<Parameter!J40,0,ROUNDUP(J35/Parameter!K19,0))","v":0},null,null,null,null,null,null,null,null,null,null,null,null,null,null,{"$f":"MIN(J35,DN35)/DN35*AK35","v":0},{"$f":"A35","v":"Vorkurs"},null,null,null,null,null,null,null,null,null,null,null,null,null,null,null,"Vorkurs",null,null,null,null,null,null,null,null,null,null,{"$f":"BR35","v":"Vorkurs"},null,null,null,null,null,null,null,null,null,null,null,null,null,null,null,null,null,null,null,{"$f":"B35","v":"VK"},null,null,null,null,null,null,null,null,{"$f":"VLOOKUP(CX35,block3,2,FALSE)","v":0},0,0,0,0,0,0,0,12,null,null,null,null,{"$f":"VLOOKUP(CX35,block3,3,FALSE)","v":0},0,0,0,0,0,0,0,null,null,null,null,null,null,null,null,null,null,null,null,null,null,null,null,null,null,null,null,{"$f":"B35","v":"VK"}]
["Vorklasse","VS",null,null,null,null,null,null,null,{"$f":"'VUÜ-SK'!M49","v":0},{"$f":"Parameter!J19","v":30},null,null,null,null,null,null,null,null,null,null,null,null,null,null,null,null,null,null,null,null,null,null,null,null,{"$f":"AL36","v":0},{"$f":"Vorklasse_BOS*AL36","v":0},{"$f":"IF(J36<Parameter!K40,0,ROUNDUP(J36/Parameter!J19,0))","v":0},null,null,null,null,null,null,null,null,null,null,null,null,null,null,{"$f":"MIN(J36,DN36)/DN36*AK36","v":0},{"$f":"A36","v":"Vorklasse"},null,null,null,null,null,null,null,null,null,null,null,null,null,null,null,"Vorklasse",null,null,null,null,null,null,null,null,null,null,{"$f":"BR36","v":"Vorklasse"},{"$f":"J36","v":0},{"$f":"IF(SUM('VUÜ-Budget'!$G$32:$J$32)=0,Parameter!X12,'VUÜ-Budget'!G32/SUM('VUÜ-Budget'!$G32:$J32))","v":0.55561005518087059},{"$f":"IF(SUM('VUÜ-Budget'!$G$32:$J$32)=0,Parameter!Y12,'VUÜ-Budget'!H32/SUM('VUÜ-Budget'!$G32:$J32))","v":0.17069282648681791},{"$f":"IF(SUM('VUÜ-Budget'!$G$32:$J$32)=0,Parameter!Z12,'VUÜ-Budget'!I32/SUM('VUÜ-Budget'!$G32:$J32))","v":0},{"$f":"IF(SUM('VUÜ-Budget'!$G$32:$J$32)=0,Parameter!AA12,'VUÜ-Budget'!J32/SUM('VUÜ-Budget'!$G32:$J32))","v":0.27369711833231147},{"$f":"CD36-SUM(CJ36:CL36)","v":0},{"$f":"ROUND($CD36*CF36,0)","v":0},0,0,{"$f":"Parameter!O19","v":28},{"$f":"ROUNDUP(CI36/$CM36,0)","v":0},0,0,0,null,{"$f":"SUM(CN36:CQ36)","v":0},{"$f":"AL36","v":0},{"$f":"SUMPRODUCT(IF(CI36:CL36>=Parameter!$J$37,1,CI36:CL36/Parameter!$J$37)*(CN36:CQ36))*CV36","v":0},{"$f":"Stundentafel!Y55","v":1},{"$f":"B36","v":"VS"},null,null,null,null,null,null,null,{"$f":"ROUND(IF(AL36=0,0,J36/AL36),0)","v":0},0,0,0,0,0,0,0,{"$f":"IF(AND(AL36=1,DE36<DN36),0,VLOOKUP(DE36,block3,2,FALSE))","v":0},12,null,{"$f":"SUMPRODUCT(AC36:AJ36,DF36:DM36)*IF(AJ36>1,1,MIN(DE27,DN36)/DN36)","v":0},{"$f":"HLOOKUP(B36,Parameter!$A$74:$G$76,2,FALSE)*DP36","v":0},{"$f":"IF(DR$33=0,0,ROUND(DQ36/DQ$33*DR$33,0))","v":0},0,0,0,0,0,0,0,{"$f":"IF(AND(AL36=1,DE36<DN36),0,VLOOKUP(DE36,block3,3,FALSE))","v":0},{"$f":"SUMPRODUCT(AC36:AJ36,DS36:DZ36)*IF(AJ36>1,1,MIN(DE27,DN36)/DN36)","v":0},{"$f":"HLOOKUP(B36,Parameter!$A$74:$G$76,3,FALSE)*EA36","v":0},{"$f":"IF(EC$33=0,0,ROUND(EB36/EB$33*EC$33,0))","v":0},{"$f":"I16*Stundentafel!$S$2*Parameter!L71","v":0},{"$f":"IF(EE$33=0,0,ROUND(ED36/ED$33*EE$33,0))","v":0},null,null,null,null,null,null,null,null,null,null,null,null,null,null,null,"VS"]
["BOS 12","12",{"$f":"M17:S20","v":0},0,0,0,0,0,0,{"$f":"SUM(C37:I37)","v":0},{"$f":"Parameter!M19","v":25},{"$f":"klassen(C37:I37,K37,Stundentafel!B13:AX13,tiefe,symmetrie)","v":0},0,0,{"$f":"COUNTIF(L37:N37,\">0\")","v":0},{"$f":"VLOOKUP(L37,mischklassen,6,FALSE)","v":0},{"$f":"VLOOKUP(L37,mischklassen,7,FALSE)","v":0},{"$f":"VLOOKUP(M37,mischklassen,6,FALSE)","v":0},{"$f":"VLOOKUP(M37,mischklassen,7,FALSE)","v":0},{"$f":"VLOOKUP(N37,mischklassen,6,FALSE)","v":0},{"$f":"VLOOKUP(N37,mischklassen,7,FALSE)","v":0},{"$f":"restschueler(C37:I37,L37:N37,K37,symmetrie)","v":0},0,0,0,0,0,0,{"$f":"ROUNDUP(V37/$K37,0)","v":0},{"$f":"ROUNDUP(W37/$K37,0)","v":0},{"$f":"ROUNDUP(X37/$K37,0)","v":0},{"$f":"ROUNDUP(Y37/$K37,0)","v":0},{"$f":"ROUNDUP(Z37/$K37,0)","v":0},{"$f":"ROUNDUP(AA37/$K37,0)","v":0},{"$f":"ROUNDUP(AB37/$K37,0)","v":0},{"$f":"O37","v":0},{"$f":"gesstunden(V37:AB37,L37:N37,K37,Stundentafel!B13:AX13)","v":0},{"$f":"SUM(AC37:AI37,O37)","v":0},{"$f":"COUNTIF($P37:$U37,AM$25)","v":0},{"$f":"COUNTIF($P37:$U37,AN$25)","v":0},0,0,0,0,0,{"$f":"zweischienen(C37,V37,AC37,AM37,Parameter!$J$34)","v":0},{"$f":"zweischienen(D37,W37,AD37,AN37,Parameter!$J$34)","v":0},{"$f":"zweischienen(E37,X37,AE37,AO37,Parameter!$J$34)","v":0},{"$f":"zweischienen(F37,Y37,AF37,AP37,Parameter!$J$34)","v":0},{"$f":"zweischienen(G37,Z37,AG37,AQ37,Parameter!$J$34)","v":0},{"$f":"zweischienen(H37,AA37,AH37,AR37,Parameter!$J$34)","v":0},{"$f":"zweischienen(I37,AB37,AI37,AS37,Parameter!$J$34)","v":0},{"$f":"budget(C37:I37,L37:N37,K37,symmetrie,Stundentafel!C126:AY126,Stundentafel!C132:AY132,Stundentafel!C138:AY138,DN37,DO37)","v":0},"12",{"$f":"(INDEX($AT37:$AZ37,BC$15)-SUM(INDEX($AC37:$AI37,BC$15),INDEX($AM37:$AS37,BC$15)))*IF($BB37=\"VS\",0,INDEX(BC$17:BC$19,VALUE(MID($A37,5,2))-10))","v":0},0,null,{"$f":"IF(IF(INDEX($AC37:$AI37,BF$15)=0,0,INDEX($V37:$AB37,BF$15)/INDEX($AC37:$AI37,BF$15))>=Parameter!$J$35,BF$20*INDEX($AC37:$AI37,BF$15)*IF($BB37=\"VS\",0,INDEX(BF$17:BF$19,VALUE(MID($A37,5,2))-10)),0)*IF(MID($BB37,3,1)=\"_\",0.5,1)","v":0},{"$f":"IF(IF(INDEX($AC37:$AI37,BG$15)=0,0,INDEX($V37:$AB37,BG$15)/INDEX($AC37:$AI37,BG$15))>=Parameter!$J$35,BG$20*INDEX($AC37:$AI37,BG$15)*IF($BB37=\"VS\",0,INDEX(BG$17:BG$19,VALUE(MID($A37,5,2))-10)),0)*IF(MID($BB37,3,1)=\"_\",0.5,1)","v":0},{"$f":"IF(IF(INDEX($AC37:$AI37,BH$15)=0,0,INDEX($V37:$AB37,BH$15)/INDEX($AC37:$AI37,BH$15))>=Parameter!$J$35,BH$20*INDEX($AC37:$AI37,BH$15)*IF($BB37=\"VS\",0,INDEX(BH$17:BH$19,VALUE(MID($A37,5,2))-10)),0)*IF(MID($BB37,3,1)=\"_\",0.5,1)","v":0},{"$f":"IF(IF(INDEX($AC37:$AI37,BI$15)=0,0,INDEX($V37:$AB37,BI$15)/INDEX($AC37:$AI37,BI$15))>=Parameter!$J$35,BI$20*INDEX($AC37:$AI37,BI$15)*IF($BB37=\"VS\",0,INDEX(BI$17:BI$19,VALUE(MID($A37,5,2))-10)),0)*IF(MID($BB37,3,1)=\"_\",0.5,1)","v":0},{"$f":"IF(IF(INDEX($AC37:$AI37,BJ$15)=0,0,INDEX($V37:$AB37,BJ$15)/INDEX($AC37:$AI37,BJ$15))>=Parameter!$J$35,BJ$20*INDEX($AC37:$AI37,BJ$15)*IF($BB37=\"VS\",0,INDEX(BJ$17:BJ$19,VALUE(MID($A37,5,2))-10)),0)*IF(MID($BB37,3,1)=\"_\",0.5,1)","v":0},{"$f":"IF(IF(INDEX($AC37:$AI37,BK$15)=0,0,INDEX($V37:$AB37,BK$15)/INDEX($AC37:$AI37,BK$15))>=Parameter!$J$35,BK$20*INDEX($AC37:$AI37,BK$15)*IF($BB37=\"VS\",0,INDEX(BK$17:BK$19,VALUE(MID($A37,5,2))-10)),0)*IF(MID($BB37,3,1)=\"_\",0.5,1)","v":0},{"$f":"IF(IF(INDEX($AC37:$AI37,BL$15)=0,0,INDEX($V37:$AB37,BL$15)/INDEX($AC37:$AI37,BL$15))>=Parameter!$J$35,BL$20*INDEX($AC37:$AI37,BL$15)*IF($BB37=\"VS\",0,INDEX(BL$17:BL$19,VALUE(MID($A37,5,2))-10)),0)*IF(MID($BB37,3,1)=\"_\",0.5,1)","v":0},{"$f":"IF(IF(INDEX($AC37:$AI37,BM$15)=0,0,INDEX($V37:$AB37,BM$15)/INDEX($AC37:$AI37,BM$15))>=Parameter!$J$35,BM$20*INDEX($AC37:$AI37,BM$15)*IF($BB37=\"VS\",0,INDEX(BM$17:BM$19,VALUE(MID($A37,5,2))-10)),0)*IF(MID($BB37,3,1)=\"_\",0.5,1)","v":0},{"$f":"(IF(AND(OR($P37=\"G\",$P37=\"W\",$P37=\"IW\"),OR($Q37=\"G\",$Q37=\"W\",$Q37=\"IW\")),IF($P37=BN$25,0.5,0)+IF($Q37=BN$25,0.5,0),0)+IF(AND(OR($R37=\"G\",$R37=\"W\",$R37=\"IW\"),OR($S37=\"G\",$S37=\"W\",$S37=\"IW\")),IF($R37=BN$25,0.5,0)+IF($S37=BN$25,0.5,0),0)+IF(AND(OR($T37=\"G\",$T37=\"W\",$T37=\"IW\"),OR($U37=\"G\",$U37=\"W\",$U37=\"IW\")),IF($T37=BN$25,0.5,0)+IF($U37=BN$25,0.5,0),0))*IF($BB37=\"VS\",0,INDEX(BK$17:BK$19,VALUE(LEFT($BB37,2))-10))*BK$20*IF(MID($BB37,3,1)=\"_\",0.5,1)","v":0},{"$f":"(IF(AND(OR($P37=\"G\",$P37=\"W\",$P37=\"IW\"),OR($Q37=\"G\",$Q37=\"W\",$Q37=\"IW\")),IF($P37=BO$25,0.5,0)+IF($Q37=BO$25,0.5,0),0)+IF(AND(OR($R37=\"G\",$R37=\"W\",$R37=\"IW\"),OR($S37=\"G\",$S37=\"W\",$S37=\"IW\")),IF($R37=BO$25,0.5,0)+IF($S37=BO$25,0.5,0),0)+IF(AND(OR($T37=\"G\",$T37=\"W\",$T37=\"IW\"),OR($U37=\"G\",$U37=\"W\",$U37=\"IW\")),IF($T37=BO$25,0.5,0)+IF($U37=BO$25,0.5,0),0))*IF($BB37=\"VS\",0,INDEX(BL$17:BL$19,VALUE(LEFT($BB37,2))-10))*BL$20*IF(MID($BB37,3,1)=\"_\",0.5,1)","v":0},{"$f":"(IF(AND(OR($P37=\"G\",$P37=\"W\",$P37=\"IW\"),OR($Q37=\"G\",$Q37=\"W\",$Q37=\"IW\")),IF($P37=BP$25,0.5,0)+IF($Q37=BP$25,0.5,0),0)+IF(AND(OR($R37=\"G\",$R37=\"W\",$R37=\"IW\"),OR($S37=\"G\",$S37=\"W\",$S37=\"IW\")),IF($R37=BP$25,0.5,0)+IF($S37=BP$25,0.5,0),0)+IF(AND(OR($T37=\"G\",$T37=\"W\",$T37=\"IW\"),OR($U37=\"G\",$U37=\"W\",$U37=\"IW\")),IF($T37=BP$25,0.5,0)+IF($U37=BP$25,0.5,0),0))*IF($BB37=\"VS\",0,INDEX(BM$17:BM$19,VALUE(LEFT($BB37,2))-10))*BM$20*IF(MID($BB37,3,1)=\"_\",0.5,1)","v":0},null,{"$f":"BB37","v":"12"},null,null,null,null,null,null,null,null,null,"zus.",{"$f":"B37","v":"12"},{"$f":"J37","v":0},{"$f":"CE36","v":0.55561005518087059},{"$f":"CF36","v":0.17069282648681791},{"$f":"CG36","v":0},{"$f":"CH36","v":0.27369711833231147},{"$f":"CD37-SUM(CJ37:CL37)","v":0},0,0,0,{"$f":"Parameter!Q19","v":28},0,0,0,0,null,{"$f":"SUM(CN37:CQ37)","v":0},{"$f":"AL37","v":0},{"$f":"SUMPRODUCT(IF(CI37:CL37>=Parameter!$J$37,1,CI37:CL37/Parameter!$J$37)*(CN37:CQ37))*CV37","v":0},{"$f":"Stundentafel!Y56","v":1},"12",{"$f":"IF(AC37=0,0,ROUND(V37/AC37,0))","v":0},{"$f":"IF(AD37=0,0,ROUND(W37/AD37,0))","v":0},{"$f":"IF(AE37=0,0,ROUND(X37/AE37,0))","v":0},{"$f":"IF(AF37=0,0,ROUND(Y37/AF37,0))","v":0},{"$f":"IF(AG37=0,0,ROUND(Z37/AG37,0))","v":0},{"$f":"IF(AH37=0,0,ROUND(AA37/AH37,0))","v":0},{"$f":"IF(AI37=0,0,ROUND(AB37/AI37,0))","v":0},{"$f":"ROUND(IF(O37=0,0,(J37-SUM(V37:AB37))/O37),0)","v":0},{"$f":"IF(AND(AC37=1,CX37<$DN37),0,VLOOKUP(CX37,block3,2,FALSE))","v":0},0,0,0,0,0,0,{"$f":"IF(AND(DE37<$DN37),0,VLOOKUP(DE37,block3,2,FALSE))","v":0},16,{"$f":"$DO$28","v":16},{"$f":"SUMPRODUCT((AC37:AJ37)*(DF37:DM37)*IF(OR((AC37:AJ37)>1,CX37:DE37)>=DN37,1,CX37:DE37/DN37))","v":0},{"$f":"HLOOKUP(B37,Parameter!$A$74:$G$76,2,FALSE)*DP37","v":0},{"$f":"IF(DR$33=0,0,ROUND(SUM(DQ37:DQ39)/DQ$33*DR$33,0))","v":0},{"$f":"IF(AND(AC37=1,CX37<$DN37),0,VLOOKUP(CX37,block3,3,FALSE))","v":0},0,0,0,0,0,0,{"$f":"IF(AND(DE37<$DN37),0,VLOOKUP(DE37,block3,3,FALSE))","v":0},{"$f":"SUMPRODUCT((AC37:AJ37)*(DS37:DZ37)*IF(OR((AC37:AJ37)>1,CX37:DE37>=DN37),1,CX37:DE37/DN37))","v":0},{"$f":"HLOOKUP(B37,Parameter!$A$74:$G$76,3,FALSE)*EA37","v":0},{"$f":"IF(EC$33=0,0,ROUND(SUM(EB37:EB39)/EB$33*EC$33,0))","v":0},{"$f":"I17*Stundentafel!$S$2*Parameter!L72","v":0},{"$f":"IF(EE$33=0,0,ROUND(SUM(ED37:ED39)/ED$33*EE$33,0))","v":0},null,null,null,null,null,null,null,null,null,null,null,null,null,null,null,"12",{"$f":"budget(C37:I37,L37:N37,K37,symmetrie,Stundentafel!$C$130:$AY$130,Stundentafel!$C$136:$AY$136,Stundentafel!$C$142:$AY$142,16,16)","v":0}]
["BOS 12_1","12_1",0,0,0,0,0,0,0,{"$f":"SUM(C38:I38)","v":0},{"$f":"K37","v":25},{"$f":"klassen(C38:I38,K38,Stundentafel!B14:AX14,tiefe,symmetrie)","v":0},0,0,{"$f":"COUNTIF(L38:N38,\">0\")","v":0},{"$f":"VLOOKUP(L38,mischklassen,6,FALSE)","v":0},{"$f":"VLOOKUP(L38,mischklassen,7,FALSE)","v":0},{"$f":"VLOOKUP(M38,mischklassen,6,FALSE)","v":0},{"$f":"VLOOKUP(M38,mischklassen,7,FALSE)","v":0},{"$f":"VLOOKUP(N38,mischklassen,6,FALSE)","v":0},{"$f":"VLOOKUP(N38,mischklassen,7,FALSE)","v":0},{"$f":"restschueler(C38:I38,L38:N38,K38,symmetrie)","v":0},0,0,0,0,0,0,{"$f":"ROUNDUP(V38/$K38,0)","v":0},{"$f":"ROUNDUP(W38/$K38,0)","v":0},{"$f":"ROUNDUP(X38/$K38,0)","v":0},{"$f":"ROUNDUP(Y38/$K38,0)","v":0},{"$f":"ROUNDUP(Z38/$K38,0)","v":0},{"$f":"ROUNDUP(AA38/$K38,0)","v":0},{"$f":"ROUNDUP(AB38/$K38,0)","v":0},{"$f":"O38","v":0},{"$f":"gesstunden(V38:AB38,L38:N38,K38,Stundentafel!B14:AX14)","v":0},{"$f":"SUM(AC38:AI38,O38)","v":0},{"$f":"COUNTIF($P38:$U38,AM$25)","v":0},0,0,0,0,0,0,{"$f":"zweischienen(C38,V38,AC38,AM38,Parameter!$J$34)","v":0},{"$f":"zweischienen(D38,W38,AD38,AN38,Parameter!$J$34)","v":0},{"$f":"zweischienen(E38,X38,AE38,AO38,Parameter!$J$34)","v":0},{"$f":"zweischienen(F38,Y38,AF38,AP38,Parameter!$J$34)","v":0},{"$f":"zweischienen(G38,Z38,AG38,AQ38,Parameter!$J$34)","v":0},{"$f":"zweischienen(H38,AA38,AH38,AR38,Parameter!$J$34)","v":0},{"$f":"zweischienen(I38,AB38,AI38,AS38,Parameter!$J$34)","v":0},{"$f":"budget(C38:I38,L38:N38,K38,symmetrie,Stundentafel!C127:AY127,Stundentafel!C133:AY133,Stundentafel!C139:AY139,DN38,DO38)","v":0},"12_1",0,0,null,{"$f":"IF(IF(INDEX($AC38:$AI38,BF$15)=0,0,INDEX($V38:$AB38,BF$15)/INDEX($AC38:$AI38,BF$15))>=Parameter!$J$35,BF$20*INDEX($AC38:$AI38,BF$15)*IF($BB38=\"VS\",0,INDEX(BF$17:BF$19,VALUE(MID($A38,5,2))-10)),0)*IF(MID($BB38,3,1)=\"_\",0.5,1)","v":0},{"$f":"IF(IF(INDEX($AC38:$AI38,BG$15)=0,0,INDEX($V38:$AB38,BG$15)/INDEX($AC38:$AI38,BG$15))>=Parameter!$J$35,BG$20*INDEX($AC38:$AI38,BG$15)*IF($BB38=\"VS\",0,INDEX(BG$17:BG$19,VALUE(MID($A38,5,2))-10)),0)*IF(MID($BB38,3,1)=\"_\",0.5,1)","v":0},{"$f":"IF(IF(INDEX($AC38:$AI38,BH$15)=0,0,INDEX($V38:$AB38,BH$15)/INDEX($AC38:$AI38,BH$15))>=Parameter!$J$35,BH$20*INDEX($AC38:$AI38,BH$15)*IF($BB38=\"VS\",0,INDEX(BH$17:BH$19,VALUE(MID($A38,5,2))-10)),0)*IF(MID($BB38,3,1)=\"_\",0.5,1)","v":0},{"$f":"IF(IF(INDEX($AC38:$AI38,BI$15)=0,0,INDEX($V38:$AB38,BI$15)/INDEX($AC38:$AI38,BI$15))>=Parameter!$J$35,BI$20*INDEX($AC38:$AI38,BI$15)*IF($BB38=\"VS\",0,INDEX(BI$17:BI$19,VALUE(MID($A38,5,2))-10)),0)*IF(MID($BB38,3,1)=\"_\",0.5,1)","v":0},{"$f":"IF(IF(INDEX($AC38:$AI38,BJ$15)=0,0,INDEX($V38:$AB38,BJ$15)/INDEX($AC38:$AI38,BJ$15))>=Parameter!$J$35,BJ$20*INDEX($AC38:$AI38,BJ$15)*IF($BB38=\"VS\",0,INDEX(BJ$17:BJ$19,VALUE(MID($A38,5,2))-10)),0)*IF(MID($BB38,3,1)=\"_\",0.5,1)","v":0},{"$f":"IF(IF(INDEX($AC38:$AI38,BK$15)=0,0,INDEX($V38:$AB38,BK$15)/INDEX($AC38:$AI38,BK$15))>=Parameter!$J$35,BK$20*INDEX($AC38:$AI38,BK$15)*IF($BB38=\"VS\",0,INDEX(BK$17:BK$19,VALUE(MID($A38,5,2))-10)),0)*IF(MID($BB38,3,1)=\"_\",0.5,1)","v":0},{"$f":"IF(IF(INDEX($AC38:$AI38,BL$15)=0,0,INDEX($V38:$AB38,BL$15)/INDEX($AC38:$AI38,BL$15))>=Parameter!$J$35,BL$20*INDEX($AC38:$AI38,BL$15)*IF($BB38=\"VS\",0,INDEX(BL$17:BL$19,VALUE(MID($A38,5,2))-10)),0)*IF(MID($BB38,3,1)=\"_\",0.5,1)","v":0},{"$f":"IF(IF(INDEX($AC38:$AI38,BM$15)=0,0,INDEX($V38:$AB38,BM$15)/INDEX($AC38:$AI38,BM$15))>=Parameter!$J$35,BM$20*INDEX($AC38:$AI38,BM$15)*IF($BB38=\"VS\",0,INDEX(BM$17:BM$19,VALUE(MID($A38,5,2))-10)),0)*IF(MID($BB38,3,1)=\"_\",0.5,1)","v":0},{"$f":"(IF(AND(OR($P38=\"G\",$P38=\"W\",$P38=\"IW\"),OR($Q38=\"G\",$Q38=\"W\",$Q38=\"IW\")),IF($P38=BN$25,0.5,0)+IF($Q38=BN$25,0.5,0),0)+IF(AND(OR($R38=\"G\",$R38=\"W\",$R38=\"IW\"),OR($S38=\"G\",$S38=\"W\",$S38=\"IW\")),IF($R38=BN$25,0.5,0)+IF($S38=BN$25,0.5,0),0)+IF(AND(OR($T38=\"G\",$T38=\"W\",$T38=\"IW\"),OR($U38=\"G\",$U38=\"W\",$U38=\"IW\")),IF($T38=BN$25,0.5,0)+IF($U38=BN$25,0.5,0),0))*IF($BB38=\"VS\",0,INDEX(BK$17:BK$19,VALUE(LEFT($BB38,2))-10))*BK$20*IF(MID($BB38,3,1)=\"_\",0.5,1)","v":0},{"$f":"(IF(AND(OR($P38=\"G\",$P38=\"W\",$P38=\"IW\"),OR($Q38=\"G\",$Q38=\"W\",$Q38=\"IW\")),IF($P38=BO$25,0.5,0)+IF($Q38=BO$25,0.5,0),0)+IF(AND(OR($R38=\"G\",$R38=\"W\",$R38=\"IW\"),OR($S38=\"G\",$S38=\"W\",$S38=\"IW\")),IF($R38=BO$25,0.5,0)+IF($S38=BO$25,0.5,0),0)+IF(AND(OR($T38=\"G\",$T38=\"W\",$T38=\"IW\"),OR($U38=\"G\",$U38=\"W\",$U38=\"IW\")),IF($T38=BO$25,0.5,0)+IF($U38=BO$25,0.5,0),0))*IF($BB38=\"VS\",0,INDEX(BL$17:BL$19,VALUE(LEFT($BB38,2))-10))*BL$20*IF(MID($BB38,3,1)=\"_\",0.5,1)","v":0},{"$f":"(IF(AND(OR($P38=\"G\",$P38=\"W\",$P38=\"IW\"),OR($Q38=\"G\",$Q38=\"W\",$Q38=\"IW\")),IF($P38=BP$25,0.5,0)+IF($Q38=BP$25,0.5,0),0)+IF(AND(OR($R38=\"G\",$R38=\"W\",$R38=\"IW\"),OR($S38=\"G\",$S38=\"W\",$S38=\"IW\")),IF($R38=BP$25,0.5,0)+IF($S38=BP$25,0.5,0),0)+IF(AND(OR($T38=\"G\",$T38=\"W\",$T38=\"IW\"),OR($U38=\"G\",$U38=\"W\",$U38=\"IW\")),IF($T38=BP$25,0.5,0)+IF($U38=BP$25,0.5,0),0))*IF($BB38=\"VS\",0,INDEX(BM$17:BM$19,VALUE(LEFT($BB38,2))-10))*BM$20*IF(MID($BB38,3,1)=\"_\",0.5,1)","v":0},null,{"$f":"BB38","v":"12_1"},null,null,null,null,null,null,null,null,null,null,{"$f":"B38","v":"12_1"},{"$f":"J38","v":0},{"$f":"CE37","v":0.55561005518087059},{"$f":"CF37","v":0.17069282648681791},{"$f":"CG37","v":0},{"$f":"CH37","v":0.27369711833231147},{"$f":"CD38-SUM(CJ38:CL38)","v":0},{"$f":"ROUND($CD38*CF38,0)","v":0},{"$f":"ROUND($CD38*CG38,0)","v":0},{"$f":"ROUND($CD38*CH38,0)","v":0},{"$f":"CM37","v":28},0,0,0,0,null,{"$f":"SUM(CN38:CQ38)","v":0},{"$f":"AL38","v":0},{"$f":"SUMPRODUCT(IF(CI38:CL38>=Parameter!$J$37,1,CI38:CL38/Parameter!$J$37)*(CN38:CQ38))*CV38","v":0},{"$f":"Stundentafel!Y57","v":0.5},"12_1",0,0,0,0,0,0,0,{"$f":"ROUND(IF(O38=0,0,(J38-SUM(V38:AB38))/O38),0)","v":0},0,0,0,0,0,0,0,{"$f":"IF(AND(DE38<$DN38),0,VLOOKUP(DE38,block3,2,FALSE))","v":0},16,{"$f":"$DO$28","v":16},{"$f":"SUMPRODUCT((AC38:AJ38)*(DF38:DM38)*IF(OR((AC38:AJ38)>1,CX38:DE38)>=DN38,1,CX38:DE38/DN38))","v":0},{"$f":"HLOOKUP(B38,Parameter!$A$74:$G$76,2,FALSE)*DP38","v":0},null,0,0,0,0,0,0,0,{"$f":"IF(AND(DE38<$DN38),0,VLOOKUP(DE38,block3,3,FALSE))","v":0},{"$f":"SUMPRODUCT((AC38:AJ38)*(DS38:DZ38)*IF(OR((AC38:AJ38)>1,CX38:DE38>=DN38),1,CX38:DE38/DN38))","v":0},{"$f":"HLOOKUP(B38,Parameter!$A$74:$G$76,3,FALSE)*EA38","v":0},null,{"$f":"I18*Stundentafel!$S$2*Parameter!L73","v":0},null,null,null,null,null,null,null,null,null,null,null,null,null,null,null,null,"12_1",{"$f":"budget(C38:I38,L38:N38,K38,symmetrie,Stundentafel!$C$130:$AY$130,Stundentafel!$C$136:$AY$136,Stundentafel!$C$142:$AY$142,16,16)/2","v":0}]
["BOS 12_2","12_2",0,0,0,0,0,0,0,{"$f":"SUM(C39:I39)","v":0},{"$f":"K38","v":25},{"$f":"klassen(C39:I39,K39,Stundentafel!B15:AX15,tiefe,symmetrie)","v":0},0,0,{"$f":"COUNTIF(L39:N39,\">0\")","v":0},{"$f":"VLOOKUP(L39,mischklassen,6,FALSE)","v":0},{"$f":"VLOOKUP(L39,mischklassen,7,FALSE)","v":0},{"$f":"VLOOKUP(M39,mischklassen,6,FALSE)","v":0},{"$f":"VLOOKUP(M39,mischklassen,7,FALSE)","v":0},{"$f":"VLOOKUP(N39,mischklassen,6,FALSE)","v":0},{"$f":"VLOOKUP(N39,mischklassen,7,FALSE)","v":0},{"$f":"restschueler(C39:I39,L39:N39,K39,symmetrie)","v":0},0,0,0,0,0,0,{"$f":"ROUNDUP(V39/$K39,0)","v":0},0,0,0,0,0,0,{"$f":"O39","v":0},{"$f":"gesstunden(V39:AB39,L39:N39,K39,Stundentafel!B15:AX15)","v":0},{"$f":"SUM(AC39:AI39,O39)","v":0},0,0,0,0,0,0,0,{"$f":"zweischienen(C39,V39,AC39,AM39,Parameter!$J$34)","v":0},{"$f":"zweischienen(D39,W39,AD39,AN39,Parameter!$J$34)","v":0},{"$f":"zweischienen(E39,X39,AE39,AO39,Parameter!$J$34)","v":0},{"$f":"zweischienen(F39,Y39,AF39,AP39,Parameter!$J$34)","v":0},{"$f":"zweischienen(G39,Z39,AG39,AQ39,Parameter!$J$34)","v":0},{"$f":"zweischienen(H39,AA39,AH39,AR39,Parameter!$J$34)","v":0},{"$f":"zweischienen(I39,AB39,AI39,AS39,Parameter!$J$34)","v":0},{"$f":"budget(C39:I39,L39:N39,K39,symmetrie,Stundentafel!C128:AY128,Stundentafel!C134:AY134,Stundentafel!C140:AY140,DN39,DO39)","v":0},"12_2",0,0,null,{"$f":"IF(IF(INDEX($AC39:$AI39,BF$15)=0,0,INDEX($V39:$AB39,BF$15)/INDEX($AC39:$AI39,BF$15))>=Parameter!$J$35,BF$20*INDEX($AC39:$AI39,BF$15)*IF($BB39=\"VS\",0,INDEX(BF$17:BF$19,VALUE(MID($A39,5,2))-10)),0)*IF(MID($BB39,3,1)=\"_\",0.5,1)","v":0},{"$f":"IF(IF(INDEX($AC39:$AI39,BG$15)=0,0,INDEX($V39:$AB39,BG$15)/INDEX($AC39:$AI39,BG$15))>=Parameter!$J$35,BG$20*INDEX($AC39:$AI39,BG$15)*IF($BB39=\"VS\",0,INDEX(BG$17:BG$19,VALUE(MID($A39,5,2))-10)),0)*IF(MID($BB39,3,1)=\"_\",0.5,1)","v":0},{"$f":"IF(IF(INDEX($AC39:$AI39,BH$15)=0,0,INDEX($V39:$AB39,BH$15)/INDEX($AC39:$AI39,BH$15))>=Parameter!$J$35,BH$20*INDEX($AC39:$AI39,BH$15)*IF($BB39=\"VS\",0,INDEX(BH$17:BH$19,VALUE(MID($A39,5,2))-10)),0)*IF(MID($BB39,3,1)=\"_\",0.5,1)","v":0},{"$f":"IF(IF(INDEX($AC39:$AI39,BI$15)=0,0,INDEX($V39:$AB39,BI$15)/INDEX($AC39:$AI39,BI$15))>=Parameter!$J$35,BI$20*INDEX($AC39:$AI39,BI$15)*IF($BB39=\"VS\",0,INDEX(BI$17:BI$19,VALUE(MID($A39,5,2))-10)),0)*IF(MID($BB39,3,1)=\"_\",0.5,1)","v":0},{"$f":"IF(IF(INDEX($AC39:$AI39,BJ$15)=0,0,INDEX($V39:$AB39,BJ$15)/INDEX($AC39:$AI39,BJ$15))>=Parameter!$J$35,BJ$20*INDEX($AC39:$AI39,BJ$15)*IF($BB39=\"VS\",0,INDEX(BJ$17:BJ$19,VALUE(MID($A39,5,2))-10)),0)*IF(MID($BB39,3,1)=\"_\",0.5,1)","v":0},{"$f":"IF(IF(INDEX($AC39:$AI39,BK$15)=0,0,INDEX($V39:$AB39,BK$15)/INDEX($AC39:$AI39,BK$15))>=Parameter!$J$35,BK$20*INDEX($AC39:$AI39,BK$15)*IF($BB39=\"VS\",0,INDEX(BK$17:BK$19,VALUE(MID($A39,5,2))-10)),0)*IF(MID($BB39,3,1)=\"_\",0.5,1)","v":0},{"$f":"IF(IF(INDEX($AC39:$AI39,BL$15)=0,0,INDEX($V39:$AB39,BL$15)/INDEX($AC39:$AI39,BL$15))>=Parameter!$J$35,BL$20*INDEX($AC39:$AI39,BL$15)*IF($BB39=\"VS\",0,INDEX(BL$17:BL$19,VALUE(MID($A39,5,2))-10)),0)*IF(MID($BB39,3,1)=\"_\",0.5,1)","v":0},{"$f":"IF(IF(INDEX($AC39:$AI39,BM$15)=0,0,INDEX($V39:$AB39,BM$15)/INDEX($AC39:$AI39,BM$15))>=Parameter!$J$35,BM$20*INDEX($AC39:$AI39,BM$15)*IF($BB39=\"VS\",0,INDEX(BM$17:BM$19,VALUE(MID($A39,5,2))-10)),0)*IF(MID($BB39,3,1)=\"_\",0.5,1)","v":0},0,0,0,null,{"$f":"BB39","v":"12_2"},null,null,null,null,null,null,null,null,null,null,{"$f":"B39","v":"12_2"},0,0.55561005518087059,0.17069282648681791,0,0.27369711833231147,0,0,0,0,{"$f":"CM38","v":28},0,0,0,0,null,{"$f":"SUM(CN39:CQ39)","v":0},0,{"$f":"SUMPRODUCT(IF(CI39:CL39>=Parameter!$J$37,1,CI39:CL39/Parameter!$J$37)*(CN39:CQ39))*CV39","v":0},{"$f":"Stundentafel!Y58","v":0.5},"12_2",0,0,0,0,0,0,0,{"$f":"ROUND(IF(O39=0,0,(J39-SUM(V39:AB39))/O39),0)","v":0},0,0,0,0,0,0,0,{"$f":"IF(AND(DE39<$DN39),0,VLOOKUP(DE39,block3,2,FALSE))","v":0},16,{"$f":"$DO$28","v":16},{"$f":"SUMPRODUCT((AC39:AJ39)*(DF39:DM39)*IF(OR((AC39:AJ39)>1,CX39:DE39)>=DN39,1,CX39:DE39/DN39))","v":0},{"$f":"HLOOKUP(B39,Parameter!$A$74:$G$76,2,FALSE)*DP39","v":0},null,0,0,0,0,0,0,0,{"$f":"IF(AND(DE39<$DN39),0,VLOOKUP(DE39,block3,3,FALSE))","v":0},{"$f":"SUMPRODUCT((AC39:AJ39)*(DS39:DZ39)*IF(OR((AC39:AJ39)>1,CX39:DE39>=DN39),1,CX39:DE39/DN39))","v":0},{"$f":"HLOOKUP(B39,Parameter!$A$74:$G$76,3,FALSE)*EA39","v":0},null,{"$f":"I19*Stundentafel!$S$2*Parameter!L74","v":0},null,null,null,null,null,null,null,null,null,null,null,null,null,null,null,null,"12_2",{"$f":"budget(C39:I39,L39:N39,K39,symmetrie,Stundentafel!$C$130:$AY$130,Stundentafel!$C$136:$AY$136,Stundentafel!$C$142:$AY$142,16,16)/2","v":0}]
["BOS 13","13",0,0,0,0,0,0,0,{"$f":"SUM(C40:I40)","v":0},{"$f":"Parameter!N19","v":25},{"$f":"klassen(C40:I40,K40,Stundentafel!B16:AX16,tiefe,symmetrie)","v":0},0,0,{"$f":"COUNTIF(L40:N40,\">0\")","v":0},{"$f":"VLOOKUP(L40,mischklassen,6,FALSE)","v":0},{"$f":"VLOOKUP(L40,mischklassen,7,FALSE)","v":0},{"$f":"VLOOKUP(M40,mischklassen,6,FALSE)","v":0},{"$f":"VLOOKUP(M40,mischklassen,7,FALSE)","v":0},{"$f":"VLOOKUP(N40,mischklassen,6,FALSE)","v":0},{"$f":"VLOOKUP(N40,mischklassen,7,FALSE)","v":0},{"$f":"restschueler(C40:I40,L40:N40,K40,symmetrie)","v":0},0,0,0,0,0,0,{"$f":"ROUNDUP(V40/$K40,0)","v":0},{"$f":"ROUNDUP(W40/$K40,0)","v":0},{"$f":"ROUNDUP(X40/$K40,0)","v":0},{"$f":"ROUNDUP(Y40/$K40,0)","v":0},{"$f":"ROUNDUP(Z40/$K40,0)","v":0},{"$f":"ROUNDUP(AA40/$K40,0)","v":0},{"$f":"ROUNDUP(AB40/$K40,0)","v":0},{"$f":"O40","v":0},{"$f":"gesstunden(V40:AB40,L40:N40,K40,Stundentafel!B16:AX16)","v":0},{"$f":"SUM(AC40:AI40,O40)","v":0},0,0,0,0,0,0,0,{"$f":"zweischienen(C40,V40,AC40,AM40,Parameter!$J$34)","v":0},{"$f":"zweischienen(D40,W40,AD40,AN40,Parameter!$J$34)","v":0},{"$f":"zweischienen(E40,X40,AE40,AO40,Parameter!$J$34)","v":0},{"$f":"zweischienen(F40,Y40,AF40,AP40,Parameter!$J$34)","v":0},{"$f":"zweischienen(G40,Z40,AG40,AQ40,Parameter!$J$34)","v":0},{"$f":"zweischienen(H40,AA40,AH40,AR40,Parameter!$J$34)","v":0},{"$f":"zweischienen(I40,AB40,AI40,AS40,Parameter!$J$34)","v":0},{"$f":"budget(C40:I40,L40:N40,K40,symmetrie,Stundentafel!C129:AY129,Stundentafel!C135:AY135,Stundentafel!C141:AY141,DN40,DO40)","v":0},"13",0,0,null,{"$f":"IF(IF(INDEX($AC40:$AI40,BF$15)=0,0,INDEX($V40:$AB40,BF$15)/INDEX($AC40:$AI40,BF$15))>=Parameter!$J$35,BF$20*INDEX($AC40:$AI40,BF$15)*IF($BB40=\"VS\",0,INDEX(BF$17:BF$19,VALUE(MID($A40,5,2))-10)),0)*IF(MID($BB40,3,1)=\"_\",0.5,1)","v":0},{"$f":"IF(IF(INDEX($AC40:$AI40,BG$15)=0,0,INDEX($V40:$AB40,BG$15)/INDEX($AC40:$AI40,BG$15))>=Parameter!$J$35,BG$20*INDEX($AC40:$AI40,BG$15)*IF($BB40=\"VS\",0,INDEX(BG$17:BG$19,VALUE(MID($A40,5,2))-10)),0)*IF(MID($BB40,3,1)=\"_\",0.5,1)","v":0},{"$f":"IF(IF(INDEX($AC40:$AI40,BH$15)=0,0,INDEX($V40:$AB40,BH$15)/INDEX($AC40:$AI40,BH$15))>=Parameter!$J$35,BH$20*INDEX($AC40:$AI40,BH$15)*IF($BB40=\"VS\",0,INDEX(BH$17:BH$19,VALUE(MID($A40,5,2))-10)),0)*IF(MID($BB40,3,1)=\"_\",0.5,1)","v":0},{"$f":"IF(IF(INDEX($AC40:$AI40,BI$15)=0,0,INDEX($V40:$AB40,BI$15)/INDEX($AC40:$AI40,BI$15))>=Parameter!$J$35,BI$20*INDEX($AC40:$AI40,BI$15)*IF($BB40=\"VS\",0,INDEX(BI$17:BI$19,VALUE(MID($A40,5,2))-10)),0)*IF(MID($BB40,3,1)=\"_\",0.5,1)","v":0},{"$f":"IF(IF(INDEX($AC40:$AI40,BJ$15)=0,0,INDEX($V40:$AB40,BJ$15)/INDEX($AC40:$AI40,BJ$15))>=Parameter!$J$35,BJ$20*INDEX($AC40:$AI40,BJ$15)*IF($BB40=\"VS\",0,INDEX(BJ$17:BJ$19,VALUE(MID($A40,5,2))-10)),0)*IF(MID($BB40,3,1)=\"_\",0.5,1)","v":0},{"$f":"IF(IF(INDEX($AC40:$AI40,BK$15)=0,0,INDEX($V40:$AB40,BK$15)/INDEX($AC40:$AI40,BK$15))>=Parameter!$J$35,BK$20*INDEX($AC40:$AI40,BK$15)*IF($BB40=\"VS\",0,INDEX(BK$17:BK$19,VALUE(MID($A40,5,2))-10)),0)*IF(MID($BB40,3,1)=\"_\",0.5,1)","v":0},{"$f":"IF(IF(INDEX($AC40:$AI40,BL$15)=0,0,INDEX($V40:$AB40,BL$15)/INDEX($AC40:$AI40,BL$15))>=Parameter!$J$35,BL$20*INDEX($AC40:$AI40,BL$15)*IF($BB40=\"VS\",0,INDEX(BL$17:BL$19,VALUE(MID($A40,5,2))-10)),0)*IF(MID($BB40,3,1)=\"_\",0.5,1)","v":0},{"$f":"IF(IF(INDEX($AC40:$AI40,BM$15)=0,0,INDEX($V40:$AB40,BM$15)/INDEX($AC40:$AI40,BM$15))>=Parameter!$J$35,BM$20*INDEX($AC40:$AI40,BM$15)*IF($BB40=\"VS\",0,INDEX(BM$17:BM$19,VALUE(MID($A40,5,2))-10)),0)*IF(MID($BB40,3,1)=\"_\",0.5,1)","v":0},0,0,0,null,{"$f":"BB40","v":"13"},null,null,null,null,null,null,null,null,null,null,"13",{"$f":"J40","v":0},{"$f":"IF(SUM('VUÜ-Budget'!$G$31:$J$31)=0,Parameter!X12,'VUÜ-Budget'!G31/SUM('VUÜ-Budget'!$G31:$J31))","v":0.55561005518087059},{"$f":"IF(SUM('VUÜ-Budget'!$G$31:$J$31)=0,Parameter!Y12,'VUÜ-Budget'!H31/SUM('VUÜ-Budget'!$G31:$J31))","v":0.17069282648681791},{"$f":"IF(SUM('VUÜ-Budget'!$G$31:$J$31)=0,Parameter!Z12,'VUÜ-Budget'!I31/SUM('VUÜ-Budget'!$G31:$J31))","v":0},{"$f":"IF(SUM('VUÜ-Budget'!$G$31:$J$31)=0,Parameter!AA12,'VUÜ-Budget'!J31/SUM('VUÜ-Budget'!$G31:$J31))","v":0.27369711833231147},{"$f":"CD40-SUM(CJ40:CL40)","v":0},{"$f":"ROUND($CD40*CF40,0)","v":0},{"$f":"ROUND($CD40*CG40,0)","v":0},{"$f":"ROUND($CD40*CH40,0)","v":0},{"$f":"Parameter!R19","v":28},0,0,0,0,null,{"$f":"SUM(CN40:CQ40)","v":0},{"$f":"AL40","v":0},{"$f":"SUMPRODUCT(IF(CI40:CL40>=Parameter!$J$37,1,CI40:CL40/Parameter!$J$37)*(CN40:CQ40))*CV40","v":0},{"$f":"Stundentafel!Y59","v":1},"13",{"$f":"IF(AC40=0,0,ROUND(V40/AC40,0))","v":0},{"$f":"IF(AD40=0,0,ROUND(W40/AD40,0))","v":0},{"$f":"IF(AE40=0,0,ROUND(X40/AE40,0))","v":0},{"$f":"IF(AF40=0,0,ROUND(Y40/AF40,0))","v":0},{"$f":"IF(AG40=0,0,ROUND(Z40/AG40,0))","v":0},{"$f":"IF(AH40=0,0,ROUND(AA40/AH40,0))","v":0},{"$f":"IF(AI40=0,0,ROUND(AB40/AI40,0))","v":0},{"$f":"ROUND(IF(O40=0,0,(J40-SUM(V40:AB40))/O40),0)","v":0},0,0,0,0,0,0,0,{"$f":"IF(AND(DE40<$DN40),0,VLOOKUP(DE40,block3,2,FALSE))","v":0},8,{"$f":"DN40","v":8},{"$f":"SUMPRODUCT((AC40:AJ40)*(DF40:DM40)*IF(OR((AC40:AJ40)>1,CX40:DE40)>=DN40,1,CX40:DE40/DN40))","v":0},{"$f":"HLOOKUP(B40,Parameter!$A$74:$G$76,2,FALSE)*DP40","v":0},{"$f":"DR33-SUM(DR36:DR37)","v":0},0,0,0,0,0,0,0,{"$f":"IF(AND(DE40<$DN40),0,VLOOKUP(DE40,block3,3,FALSE))","v":0},{"$f":"SUMPRODUCT((AC40:AJ40)*(DS40:DZ40)*IF(OR((AC40:AJ40)>1,CX40:DE40>=DN40),1,CX40:DE40/DN40))","v":0},{"$f":"HLOOKUP(B40,Parameter!$A$74:$G$76,3,FALSE)*EA40","v":0},{"$f":"EC33-SUM(EC36:EC37)","v":0},{"$f":"I20*Stundentafel!$S$2*Parameter!L75","v":0},{"$f":"EE33-SUM(EE36:EE37)","v":0},null,null,null,null,null,null,null,null,null,null,null,null,null,null,null,"13"]
["Seminare",null,null,null,null,null,null,null,null,null,null,null,null,null,null,null,null,null,null,null,null,null,null,null,null,null,null,null,null,null,null,null,null,null,null,null,null,null,null,null,null,null,null,null,null,null,null,null,null,null,null,null,null,"Seminare",null,null,null,null,null,null,null,null,null,null,null,null,null,null,null,{"$f":"BB41","v":"Seminare"},null,null,null,null,null,null,null,null,null,null,"Seminare"]
[{"$f":"Stundentafel!E2","v":2},null,null,null,{"$f":"Parameter!J66","v":8},null,null,null,null,null,null,null,"Basisbedarf",null,null,"Zuschlag",null,null,"Gesamt (LWS)",null,null,null,"Basisbedarf",null,null,"Zuschlag",null,null,"Gesamt (LWS)",null,null,null,null,null,null,null,null,null,null,null,null,null,null,null,null,null,null,null,null,null,null,null,null,"ungerundet",null,null,null,null,null,null,null,null,null,null,"Verteilung des gerundeten Werts"]
["Seminare",null,"FOS","BOS","S","Basis","Æ","Zuschlag1","Zuschlag2","Seminare","Æ","%","FOS","BOS","insg","FOS","BOS","insg","FOS","BOS","insg",null,"FOS","BOS","insg","FOS","BOS","insg","FOS","BOS","insg",null,null,null,null,null,null,null,null,null,null,null,null,null,null,null,null,null,null,null,null,null,null,"FOS",{"$f":"AT34","v":"T"},"W","S","G","A","IW","GP","S","aufger.",null,{"$f":"BC43","v":"T"},{"$f":"BD43","v":"W"},"S","G","A","IW","GP","S"]
["Jgst 13",null,{"$f":"J30","v":0},{"$f":"J40","v":0},{"$f":"SUM(C44:D44)","v":0},{"$f":"ROUNDUP(E44/Parameter!$S$20,0)","v":0},{"$f":"IF(F44=0,0,E44/F44)","v":0},{"$f":"IF(E44<E42,0,VLOOKUP(G44,Parameter!I43:J45,2,TRUE))","v":0},{"$f":"IF(E44<E42,0,IF(AND(F44+H44>0,F44+H44<Parameter!M43),1,0))","v":0},{"$f":"SUM(F44,H44:I44)","v":0},{"$f":"IF(J44=0,0,E44/J44)","v":0},{"$f":"MIN(E44,E42)/E42","v":0},{"$f":"IF(E44=0,0,O44*C44/E44)","v":0},{"$f":"O44-M44","v":0},{"$f":"F44*$A$42","v":0},{"$f":"S44-M44","v":0},{"$f":"T44-N44","v":0},0,{"$f":"IF(E44=0,0,U44*C44/E44)","v":0},{"$f":"U44-S44","v":0},{"$f":"J44*A42","v":0},null,{"$f":"L44*M44:U44","v":0},0,0,0,0,0,0,0,0,null,null,null,null,null,null,null,null,null,null,null,null,null,null,null,null,null,null,null,null,null,null,{"$f":"BB26","v":"Vorkurs"},null,null,null,null,null,null,null,{"$f":"SUM(BC44:BI44)","v":0}]
["Wahlpflichtfächer ",null,null,null,null,null,null,null,null,null,null,null,null,null,null,null,null,null,null,null,null,null,null,null,null,null,null,null,null,null,null,null,null,null,null,null,null,null,null,null,null,null,null,null,null,null,null,null,null,null,null,null,null,{"$f":"BB27","v":"Vorklasse"},null,null,null,null,null,null,null,{"$f":"SUM(BC45:BI45)","v":0}]
[null,"Jgst. 12",2,1,0,-1]
[{"$f":"Stundentafel!F2","v":2},"Jgst 13",1,1,0,-1,null,null,null,null,"ohne Überbelegung",null,null,null,{"$f":"Parameter!$I$53","v":0.2},null,null,null,null,null,null,null,"Basisbedarf",null,null,"Zuschlag 1 (Wahlfr)",null,null,"Zuschlag 2 (Überbel)",null,null,"Gesamt (LWS)",null,null,null,"Basisbedarf",null,null,"Zuschlag 1 (Wahlfr)",null,null,"Zuschlag 2 (Überbel)",null,null,"Gesamt (LWS)",null,null,null,null,null,null,null,null,{"$f":"BB28","v":"11"},{"$f":"SUMIF($BC$25:$BP$25,BC$43,$BC28:$BP28)","v":0},0,0,0,0,0,0,0,{"$f":"ROUNDUP(BJ47,0)","v":0},{"$f":"BB47","v":"11"},{"$f":"spezialaufrunden(BC47:BI47,0)","v":0},0,0,0,0,0,0,{"$f":"SUM(BM47:BS47)","v":0}]
["WPF",null,"FOS","BOS","S","2. FSpr","TNR","1. Basis","Æ",null,"Zuschlag1","Zuschlag2","Wert2",null,"Überbel","TNR*","Basis*","Æ","Zuschlag1","Zuschlag2","Wert3","Mindest","FOS","BOS","insg","FOS","BOS","insg","FOS","BOS","insg","FOS","BOS","insg",{"$f":"Parameter!J66*2","v":16},"FOS","BOS","insg","FOS","BOS","insg","FOS","BOS","insg","FOS","BOS","insg",null,null,null,null,null,null,{"$f":"BB29","v":"12"},0,0,0,0,0,0,0,0,{"$f":"ROUNDUP(BJ48,0)","v":0},{"$f":"BB48","v":"12"},{"$f":"spezialaufrunden(BC48:BI48,0)","v":0},0,0,0,0,0,0,{"$f":"SUM(BM48:BS48)","v":0}]
["Jgst 12",null,{"$f":"J29","v":0},{"$f":"J37+SUM(J38:J39)/2","v":0},{"$f":"SUM(C49:D49)","v":0},{"$f":"'VUÜ-SK'!J69","v":0},{"$f":"SUMPRODUCT(C46:F46,C49:F49)","v":0},{"$f":"ROUNDUP(G49/Parameter!$Q$20,0)+IF(ROUNDUP(G49/Parameter!$Q$20,0)=1,1,0)","v":0},{"$f":"IF(H49=0,0,G49/H49)","v":0},null,{"$f":"VLOOKUP(I49,Parameter!$I$49:$J$51,2,TRUE)","v":0},{"$f":"IF(AND(H49+K49>0,H49+K49<Parameter!$M49),1,0)","v":0},{"$f":"SUM(H49,K49:L49)","v":0},null,{"$f":"ROUND(Parameter!$I$53*E49,0)","v":0},{"$f":"O49+G49","v":0},{"$f":"ROUNDUP(P49/Parameter!$Q$20,0)+IF(ROUNDUP(P49/Parameter!$Q$20,0)=1,1,0)","v":0},{"$f":"IF(Q49=0,0,P49/Q49)","v":0},{"$f":"VLOOKUP(R49,Parameter!$I$49:$J$51,2,TRUE)","v":0},{"$f":"IF(AND(Q49+S49>0,Q49+S49<Parameter!$M49),1,0)","v":0},{"$f":"SUM(Q49,S49:T49)","v":0},{"$f":"2*Parameter!J66","v":16},{"$f":"IF($E49=0,0,$C49/$E49*Y49)","v":0},{"$f":"Y49-W49","v":0},{"$f":"H49*$A$47","v":0},{"$f":"IF($E49=0,0,$C49/$E49*AB49)","v":0},{"$f":"AB49-Z49","v":0},{"$f":"IF(E49<V49,0,(M49-H49)*$A$47)","v":0},{"$f":"IF($E49=0,0,$C49/$E49*AE49)","v":0},{"$f":"AE49-AC49","v":0},{"$f":"IF(E49<V49,0,(U49-M49)*$A$47)","v":0},{"$f":"SUM(W49,Z49,AC49)","v":0},{"$f":"SUM(X49,AA49,AD49)","v":0},{"$f":"SUM(AF49:AG49)","v":0},{"$f":"MIN(E49,Parameter!J66*2)/(Parameter!J66*2)","v":0},{"$f":"W49:AH49*AI49","v":0},0,0,0,0,0,0,0,0,0,0,0,null,null,null,null,null,null,{"$f":"BB30","v":"13"},0,0,0,0,0,0,0,0,{"$f":"ROUNDUP(BJ49,0)","v":0},{"$f":"BB49","v":"13"},{"$f":"spezialaufrunden(BC49:BI49,0)","v":0},0,0,0,0,0,0,{"$f":"SUM(BM49:BS49)","v":0}]
["Jgst 13",null,{"$f":"J30","v":0},{"$f":"J40","v":0},{"$f":"SUM(C50:D50)","v":0},{"$f":"'VUÜ-SK'!J70","v":0},{"$f":"SUMPRODUCT(C47:F47,C50:F50)","v":0},{"$f":"ROUNDUP(G50/Parameter!$R$20,0)","v":0},{"$f":"IF(H50=0,0,G50/H50)","v":0},null,{"$f":"VLOOKUP(I50,Parameter!$I$49:$J$51,2,TRUE)","v":0},{"$f":"IF(AND(H50+K50>0,H50+K50<Parameter!$M50),1,0)","v":0},{"$f":"SUM(H50,K50:L50)","v":0},null,{"$f":"ROUND(Parameter!$I$53*E50,0)","v":0},{"$f":"O50+G50","v":0},{"$f":"ROUNDUP(P50/Parameter!$R$20,0)","v":0},{"$f":"IF(Q50=0,0,P50/Q50)","v":0},{"$f":"VLOOKUP(R50,Parameter!$I$49:$J$51,2,TRUE)","v":0},{"$f":"IF(AND(Q50+S50>0,Q50+S50<Parameter!$M50),1,0)","v":0},{"$f":"SUM(Q50,S50:T50)","v":0},{"$f":"Parameter!J66","v":8},{"$f":"IF(E50=0,0,C50/E50*Y50)","v":0},{"$f":"Y50-W50","v":0},{"$f":"H50*$A$47","v":0},{"$f":"IF($E50=0,0,$C50/$E50*AB50)","v":0},{"$f":"AB50-Z50","v":0},{"$f":"IF(E50<V50,0,(M50-H50)*$A$47)","v":0},{"$f":"IF($E50=0,0,$C50/$E50*AE50)","v":0},{"$f":"AE50-AC50","v":0},{"$f":"IF(E50<V50,0,(U50-M50)*$A$47)","v":0},{"$f":"SUM(W50,Z50,AC50)","v":0},{"$f":"SUM(X50,AA50,AD50)","v":0},{"$f":"SUM(AF50:AG50)","v":0},{"$f":"MIN(E50,Parameter!J66)/Parameter!J66","v":0},{"$f":"AI50*W50:AH50","v":0},0,0,0,0,0,0,0,0,0,0,0,null,null,null,null,null,null,"Summe",{"$f":"SUM(BC44:BC49)","v":0},{"$f":"SUM(BD44:BD49)","v":0},0,0,0,0,0,{"$f":"SUM(BJ47:BJ49)","v":0},{"$f":"SUM(BK47:BK49)","v":0},null,{"$f":"SUM(BM44:BM49)","v":0},{"$f":"SUM(BN44:BN49)","v":0},0,0,0,0,0,{"$f":"SUM(BM50:BS50)","v":0}]
[null,null,null,null,null,null,null,null,null,null,null,null,null,null,null,null,null,null,null,null,null,null,"BOS 12",{"$f":"IF(D49=0,0,ROUND(J37/D49*X49,0))","v":0},null,"BOS 12",{"$f":"IF(D49=0,0,ROUND(J37/D49*AA49,0))","v":0},null,"BOS 12",{"$f":"IF(D49=0,0,ROUND(J37/D49*AD49,0))","v":0}]
["Informatik",null,null,null,null,null,null,null,null,null,1,"Teilungsstunde pro Inf-Kurs",null,null,null,null,null,null,null,null,null,null,"BOS 12/1",{"$f":"IF(D49=0,0,ROUND((J38/2)/D49*X49,0))","v":0},null,"BOS 12/1",{"$f":"IF(D49=0,0,ROUND((J38/2)/D49*AA49,0))","v":0},null,"BOS 12/1",{"$f":"IF(D49=0,0,ROUND((J38/2)/D49*AD49,0))","v":0}]
["Informatik",null,"Grund","mit FSpr.","o. FSpr.","mit FSpr.","o. FSpr.","TNR","Schüler","Kurse","LWS","LWS","%",null,null,null,null,null,null,null,null,null,"BOS 12/2",{"$f":"X49-SUM(X51:X52)","v":0},null,"BOS 12/2",{"$f":"AA49-SUM(AA51:AA52)","v":0},null,"BOS 12/2",{"$f":"AD49-SUM(AD51:AD52)","v":0},null,null,null,null,null,null,null,null,null,null,null,null,null,null,null,null,null,null,null,null,null,null,null,"ungerundet",null,null,null,null,null,null,null,null,null,null,"Verteilung des gerundeten Werts"]
["FOS12",null,{"$f":"SUMPRODUCT(C29:I29,Parameter!$I$56:$O$56)","v":0},{"$f":"IF('VUÜ-SK'!$D$69=0,0,'VUÜ-SK'!$J$69/'VUÜ-SK'!$D$69*C54)","v":0},{"$f":"C54-D54","v":0},1,1,{"$f":"SUMPRODUCT(F54:G54,D54:E54)","v":0},null,null,null,{"$f":"IF(SUM(H54:H55)=0,0,H54/SUM(H54:H55)*K55)","v":0},null,null,null,null,null,null,null,null,null,null,null,null,null,null,null,null,null,null,null,null,null,null,null,null,null,null,null,null,null,null,null,null,null,null,null,null,null,null,null,null,null,"BOS",{"$f":"BC43","v":"T"},{"$f":"BD43","v":"W"},"S","G","A","IW","GP","S","aufger.",null,{"$f":"BC54","v":"T"},{"$f":"BD54","v":"W"},{"$f":"BE54","v":"S"},{"$f":"BF54","v":"G"},{"$f":"BG54","v":"A"},{"$f":"BH54","v":"IW"},{"$f":"BI54","v":"GP"},"S"]
["BOS12",null,{"$f":"SUMPRODUCT(C37:I37,Parameter!$I$56:$O$56)+0.5*(SUMPRODUCT(C38:I38,Parameter!$I$56:$O$56)+SUMPRODUCT(C39:I39,Parameter!$I$56:$O$56))","v":0},{"$f":"IF('VUÜ-SK'!$D$69=0,0,'VUÜ-SK'!$J$69/'VUÜ-SK'!$D$69*C55)","v":0},{"$f":"C55-D55","v":0},{"$f":"Parameter!$I$53","v":0.2},1,{"$f":"SUMPRODUCT(F55:G55,D55:E55)","v":0},{"$f":"ROUND(SUM(H54:H55),0)","v":0},{"$f":"ROUNDUP(I55/Parameter!Q20,0)","v":0},{"$f":"J55*$K$52*M55","v":0},{"$f":"K55-L54","v":0},{"$f":"MIN(I55,Parameter!$J$66*2)/(Parameter!$J$66*2)","v":0},null,null,null,null,null,null,null,null,null,null,null,null,null,null,null,null,null,null,null,null,null,null,null,null,null,null,null,null,null,null,null,null,null,null,null,null,null,null,null,null,{"$f":"BB36","v":"Vorklasse"},{"$f":"SUMIF($BC$25:$BP$25,BC$43,$BC36:$BP36)","v":0},{"$f":"SUMIF($BC$25:$BP$25,BD$43,$BC36:$BP36)","v":0},0,0,0,0,0,{"$f":"SUM(BC55:BI55)","v":0},{"$f":"ROUNDUP(BJ55,0)","v":0},null,{"$f":"spezialaufrunden(BC55:BI55,0)","v":0},0,0,0,0,0,0]
["FOS13",null,{"$f":"SUMPRODUCT(C30:I30,Parameter!$I$57:$O$57)","v":0},{"$f":"IF('VUÜ-SK'!$D$70=0,0,'VUÜ-SK'!$J$70/'VUÜ-SK'!$D$70*C56)","v":0},{"$f":"C56-D56","v":0},{"$f":"Parameter!$I$53","v":0.2},1,0,null,null,null,{"$f":"IF(SUM(H56:H57)=0,0,H56/SUM(H56:H57)*K57)","v":0},null,null,null,null,null,null,null,null,null,null,null,null,null,null,null,null,null,null,null,null,null,null,null,null,null,null,null,null,null,null,null,null,null,null,null,null,null,null,null,null,null,{"$f":"BB37","v":"12"},{"$f":"SUMIF($BC$25:$BP$25,BC$43,$BC37:$BP37)","v":0},0,0,0,0,0,0,{"$f":"SUM(BC56:BI56)","v":0},{"$f":"ROUNDUP(BJ56,0)","v":0},{"$f":"BB56","v":"12"},{"$f":"spezialaufrunden(BC56:BI56,0)","v":0},0,0,0,0,0,0,{"$f":"SUM(BM56:BS56)","v":0}]
["BOS13",null,{"$f":"SUMPRODUCT(C40:I40,Parameter!$I$57:$O$57)","v":0},{"$f":"IF('VUÜ-SK'!$D$70=0,0,'VUÜ-SK'!$J$70/'VUÜ-SK'!$D$70*C57)","v":0},0,{"$f":"Parameter!$I$53","v":0.2},1,0,{"$f":"ROUND(SUM(H56:H57),0)","v":0},{"$f":"ROUNDUP(I57/Parameter!R20,0)","v":0},{"$f":"J57*$K$52*M57","v":0},{"$f":"K57-L56","v":0},{"$f":"MIN(I57,Parameter!$J$66)/(Parameter!$J$66)","v":0},null,null,null,null,null,null,null,null,null,null,null,null,null,null,null,null,null,null,null,null,null,null,null,null,null,null,null,null,null,null,null,null,null,null,null,null,null,null,null,null,{"$f":"BB38","v":"12_1"},{"$f":"SUMIF($BC$25:$BP$25,BC$43,$BC38:$BP38)","v":0},0,0,0,0,0,0,0,{"$f":"ROUNDUP(BJ57,0)","v":0},{"$f":"BB57","v":"12_1"},{"$f":"spezialaufrunden(BC57:BI57,0)","v":0},0,0,0,0,0,0,{"$f":"SUM(BM57:BS57)","v":0}]
[null,null,null,null,null,null,null,null,null,null,null,null,null,null,null,null,null,null,null,null,null,null,null,null,null,null,null,null,null,null,null,null,null,null,null,null,null,null,null,null,null,null,null,null,null,null,null,null,null,null,null,null,null,{"$f":"BB39","v":"12_2"},{"$f":"SUMIF($BC$25:$BP$25,BC$43,$BC39:$BP39)","v":0},0,0,0,0,0,0,0,{"$f":"ROUNDUP(BJ58,0)","v":0},{"$f":"BB58","v":"12_2"},{"$f":"spezialaufrunden(BC58:BI58,0)","v":0},0,0,0,0,0,0,{"$f":"SUM(BM58:BS58)","v":0}]
["Fsprache IW",null,null,{"$f":"SUM(D61:D67)","v":0},{"$f":"SUM(E61:E67)","v":0},{"$f":"SUM(F61:F67)","v":0},{"$f":"Parameter!J66","v":8},null,null,null,null,null,null,null,null,null,null,null,null,null,null,null,null,null,null,null,null,null,null,null,null,null,null,null,null,null,null,null,null,null,null,null,null,null,null,null,null,null,null,null,null,null,null,{"$f":"BB40","v":"13"},{"$f":"SUMIF($BC$25:$BP$25,BC$43,$BC40:$BP40)","v":0},0,0,0,0,0,0,0,{"$f":"ROUNDUP(BJ59,0)","v":0},{"$f":"BB59","v":"13"},{"$f":"spezialaufrunden(BC59:BI59,0)","v":0},0,0,0,0,0,0,{"$f":"SUM(BM59:BS59)","v":0}]
["Profil-IW",null,"Jgst","IW-Klassen","Grundbed","Zusatz","%","Grundbed","Zusatz",null,null,null,null,null,null,null,null,null,null,null,null,null,null,null,null,null,null,null,null,null,null,null,null,null,null,null,null,null,null,null,null,null,null,null,null,null,null,null,null,null,null,null,null,"Summe",{"$f":"SUM(BC55:BC59)","v":0},{"$f":"SUM(BD55:BD59)","v":0},0,0,0,0,0,{"$f":"SUM(BJ55:BJ59)","v":0},{"$f":"SUM(BK55:BK59)","v":0},null,{"$f":"SUM(BM55:BM59)","v":0},{"$f":"SUM(BN55:BN59)","v":0},0,0,0,0,0,{"$f":"SUM(BM60:BS60)","v":0}]
["FOS",null,"11",{"$f":"AH28+AR28","v":0},{"$f":"VLOOKUP(C61,Stundentafel!$P$54:$R$60,2,FALSE)*D61","v":0},{"$f":"IF(AND(D61>=1,D61<=Parameter!$J$58),1,0)*VLOOKUP(C61,Stundentafel!$P$54:$R$60,2,FALSE)","v":0},{"$f":"MIN(H28,Parameter!$J$66)/Parameter!$J$66","v":0},{"$f":"E61:E67*G61:G67","v":0},{"$f":"F61:F67*G61:G67","v":0}]
["FOS",null,"12",{"$f":"AH29+AR29","v":0},{"$f":"VLOOKUP(C62,Stundentafel!$P$54:$R$60,2,FALSE)*D62","v":0},{"$f":"IF(AND(D62>=1,D62<=Parameter!$J$58),1,0)*VLOOKUP(C62,Stundentafel!$P$54:$R$60,2,FALSE)","v":0},{"$f":"MIN(H29,Parameter!$J$66)/Parameter!$J$66","v":0},0,0,null,null,null,null,null,null,null,null,null,null,null,null,null,null,null,null,null,null,null,null,null,null,null,null,null,null,null,null,null,null,null,null,null,null,null,null,null,null,null,null,null,null,null,null,null,null,null,null,null,null,null,null,null,null,"Zusammenfassung Jahrgangsstufe 12 (BOS)"]
["FOS",null,"13",{"$f":"AH30+AR30","v":0},{"$f":"VLOOKUP(C63,Stundentafel!$P$54:$R$60,2,FALSE)*D63","v":0},{"$f":"IF(AND(D63>=1,D63<=Parameter!$J$58),1,0)*VLOOKUP(C63,Stundentafel!$P$54:$R$60,2,FALSE)","v":0},{"$f":"MIN(H30,Parameter!$J$66)/Parameter!$J$66","v":0},0,0,null,null,null,null,null,null,null,null,null,null,null,null,null,null,null,null,null,null,null,null,null,null,null,null,null,null,null,null,null,null,null,null,null,null,null,null,null,null,null,null,null,null,null,null,null,null,null,null,null,null,null,null,null,null,"12",{"$f":"SUM(BM56:BM58)","v":0},{"$f":"SUM(BN56:BN58)","v":0},0,0,0,0,0]
["BOS",null,"12",{"$f":"AH37+AR37","v":0},{"$f":"ROUNDUP(D64/2,0)*VLOOKUP(C64,Stundentafel!$P$54:$R$60,3,FALSE)+(D64-ROUNDUP(D64/2,0))*VLOOKUP(C64,Stundentafel!$P$54:$R$60,2,FALSE)","v":0},{"$f":"IF(AND(D64>=1,D64<=Parameter!$J$58),1,0)*IF(MOD(D64,2)=0,VLOOKUP(C64,Stundentafel!$P$54:$R$60,3,FALSE),VLOOKUP(C64,Stundentafel!$P$54:$R$60,2,FALSE))","v":0},{"$f":"MIN(H37,Parameter!$J$66)/Parameter!$J$66","v":0},0,0,null,null,null,null,null,null,null,null,null,null,null,null,null,null,null,null,null,null,null,null,null,null,null,null,null,null,null,null,null,null,null,null,null,null,null,null,null,null,null,null,null,null,null,null,null,null,null,null,null,null,null,null,null,null,"13",{"$f":"BM59","v":0},{"$f":"BN59","v":0},0,0,0,0,0]
["BOS",null,"12_1",{"$f":"AH38+AR38","v":0},{"$f":"ROUNDUP(D65/2,0)*VLOOKUP(C65,Stundentafel!$P$54:$R$60,3,FALSE)+(D65-ROUNDUP(D65/2,0))*VLOOKUP(C65,Stundentafel!$P$54:$R$60,2,FALSE)","v":0},{"$f":"IF(AND(D65>=1,D65<=Parameter!$J$58),1,0)*IF(MOD(D65,2)=0,VLOOKUP(C65,Stundentafel!$P$54:$R$60,3,FALSE),VLOOKUP(C65,Stundentafel!$P$54:$R$60,2,FALSE))","v":0},{"$f":"MIN(H38,Parameter!$J$66)/Parameter!$J$66","v":0},0,0]
["BOS",null,"12_2",{"$f":"AH39+AR39","v":0},{"$f":"ROUNDUP(D66/2,0)*VLOOKUP(C66,Stundentafel!$P$54:$R$60,3,FALSE)+(D66-ROUNDUP(D66/2,0))*VLOOKUP(C66,Stundentafel!$P$54:$R$60,2,FALSE)","v":0},{"$f":"IF(AND(D66>=1,D66<=Parameter!$J$58),1,0)*IF(MOD(D66,2)=0,VLOOKUP(C66,Stundentafel!$P$54:$R$60,3,FALSE),VLOOKUP(C66,Stundentafel!$P$54:$R$60,2,FALSE))","v":0},{"$f":"MIN(H39,Parameter!$J$66)/Parameter!$J$66","v":0},0,0]
["BOS",null,"13",{"$f":"AH40+AR40","v":0},{"$f":"VLOOKUP(C67,Stundentafel!$P$54:$R$60,2,FALSE)*D67","v":0},{"$f":"IF(AND(D67>=1,D67<=Parameter!$J$58),1,0)*VLOOKUP(C67,Stundentafel!$P$54:$R$60,2,FALSE)","v":0},{"$f":"MIN(H40,Parameter!$J$66)/Parameter!$J$66","v":0},0,0]
[null,null,null,null,null,null,null,null,null,null,null,null,null,null,null,null,null,null,null,"fpV-Teilungen"]
["fachpraktische Ausbildung ",null,null,null,null,null,null,null,null,null,null,null,null,null,null,"S = Z-E",null,null,null,"Umfang",0.5,{"$f":"Parameter!J35","v":20}]
[{"$f":"Parameter!M39","v":8},null,"T","W","S","A","G","IW","GP","insg","reine K","MischKl","fpAnl","fpV",null,"Schüler","Betriebe","fpB",null,"T","W","S","G","A","IW","GP","S","fpV-Teil"]
["Schüler: E + A",null,{"$f":"SUM('VUÜ-SK'!F26,'VUÜ-SK'!F27)","v":0},null,null,{"$f":"SUM('VUÜ-SK'!I26,'VUÜ-SK'!I27)","v":0},{"$f":"SUM('VUÜ-SK'!J26,'VUÜ-SK'!J27)","v":0},null,null,{"$f":"SUM(C71:I71)","v":0},{"$f":"SUM(AC28:AI28)","v":0},{"$f":"O28","v":0},{"$f":"budget(C28:I28,L28:N28,K28,symmetrie,Stundentafel!C103:AY103,Stundentafel!C109:AY109,Stundentafel!C115:AY115,16,16)","v":0},{"$f":"M71","v":0},null,{"$f":"'VUÜ-SK'!M25-'VUÜ-SK'!M26","v":0},{"$f":"'VUÜ-SK'!M31","v":0},{"$f":"SUMPRODUCT(P71:Q71,Stundentafel!O2:P2)","v":0},null,{"$f":"IF(AC28=0,0,IF(V28/AC28>=Parameter!$J$35,Stundentafel!$M$2*$U$69*AC28,0))","v":0},{"$f":"IF(AD28=0,0,IF(W28/AD28>=Parameter!$J$35,Stundentafel!$M$2*$U$69*AD28,0))","v":0},{"$f":"IF(AE28=0,0,IF(X28/AE28>=Parameter!$J$35,Stundentafel!$M$2*$U$69*AE28,0))","v":0},{"$f":"IF(AF28=0,0,IF(Y28/AF28>=Parameter!$J$35,Stundentafel!$M$2*$U$69*AF28,0))","v":0},{"$f":"IF(AG28=0,0,IF(Z28/AG28>=Parameter!$J$35,Stundentafel!$M$2*$U$69*AG28,0))","v":0},{"$f":"IF(AH28=0,0,IF(AA28/AH28>=Parameter!$J$35,Stundentafel!$M$2*$U$69*AH28,0))","v":0},{"$f":"IF(AI28=0,0,IF(AB28/AI28>=Parameter!$J$35,Stundentafel!$M$2*$U$69*AI28,0))","v":0},{"$f":"SUM(T71:Z71)","v":0},{"$f":"AA71","v":0}]
["Gruppen",null,{"$f":"fpa(C71,Parameter!$L$18,Parameter!$T$18)","v":0},null,null,{"$f":"fpa(F71,Parameter!$L$18,Parameter!$T$18)","v":0},{"$f":"fpa(G71,Parameter!$L$18,Parameter!$T$18)","v":0},null,null,{"$f":"fpa(J71,Parameter!$M$18,Parameter!$T$18)","v":0}]
["LWS",null,{"$f":"C72*Stundentafel!$J$2*MIN(C71,$A$70)/$A$70","v":0},null,null,{"$f":"F72*Stundentafel!$J$2*MIN(F71,$A$70)/$A$70","v":0},{"$f":"G72*Stundentafel!$J$2*MIN(G71,$A$70)/$A$70","v":0},null,null,{"$f":"SUM(C73:I73)","v":0}]
[]
["Duale Berufsausbildung und Fachhochschulreife"]
[null,null,"Absch 1",null,"Absch 2",null,"Absch 3/1",null,"Absch 3/2"]
[null,null,"T","W","T","W","T","W","T","W"]
["Schüler",null,{"$f":"'VUÜ-SK'!F36","v":0},{"$f":"'VUÜ-SK'!G36","v":0},{"$f":"'VUÜ-SK'!F37","v":0},{"$f":"'VUÜ-SK'!G37","v":0},{"$f":"'VUÜ-SK'!F38","v":0},{"$f":"'VUÜ-SK'!G38","v":0},{"$f":"'VUÜ-SK'!F39","v":0},{"$f":"'VUÜ-SK'!G39","v":0},{"$f":"SUM(C78:J78)","v":0}]
["Gruppen",null,{"$f":"ROUNDUP(C78/Parameter!$L$18,0)","v":0},{"$f":"ROUNDUP(D78/Parameter!$L$18,0)","v":0},{"$f":"ROUNDUP(E78/Parameter!$L$18,0)","v":0},{"$f":"ROUNDUP(F78/Parameter!$L$18,0)","v":0},{"$f":"ROUNDUP(G78/Parameter!$L$18,0)","v":0},{"$f":"ROUNDUP(H78/Parameter!$L$18,0)","v":0},{"$f":"ROUNDUP(I78/Parameter!$L$18,0)","v":0},{"$f":"ROUNDUP(J78/Parameter!$L$18,0)","v":0},{"$f":"SUM(C79:J79)","v":0}]
["Stdtafel",null,{"$f":"DBFH!H24","v":5},{"$f":"DBFH!B24","v":5.5},{"$f":"DBFH!I24","v":8},{"$f":"DBFH!C24","v":7},{"$f":"DBFH!J24","v":4.5},{"$f":"DBFH!D24","v":6.25},{"$f":"DBFH!K24","v":17},{"$f":"DBFH!E24","v":17}]
["LWS",null,{"$f":"C80*C79","v":0},{"$f":"D80*D79","v":0},0,0,0,0,0,0,{"$f":"SUM(C81:J81)","v":0},{"$f":"ROUNDUP(K81,0)","v":0}]
[]
[]
["Integrationsvorklasse",null,null,null,{"$f":"Parameter!L39","v":8},null,null,null,null,"Vorklassen-Profilzuschläge",null,null,null,null,null,null,null,null,null,null,"Schüler",null,null,"voll"]
[null,null,"S","K","Basis","Schnitt","Zusatz",null,null,"FOS 11","BOS 12","T","W","S","G","A","IW","GP","Abr","Klassen","FOS","BOS","Zuschlag","FOS","BOS","FOS","BOS"]
[null,null,{"$f":"'VUÜ-Budget'!H24","v":0},{"$f":"ROUNDUP(C86/Parameter!U18,0)","v":0},{"$f":"D86*Stundentafel!Q2*MIN(C86,E84)/E84","v":0},{"$f":"IF(D86=0,0,C86/D86)","v":0},{"$f":"IF(D86=0,0,HLOOKUP(F86,Parameter!$I$61:$K$62,2,TRUE))*D86*MIN(C86,E84)/E84","v":0},null,null,{"$f":"J28","v":0},{"$f":"SUM(J37:J39)","v":0},{"$f":"SUM(C28,C37:C39)","v":0},{"$f":"SUM(D28,D37:D39)","v":0},0,0,0,0,0,{"$f":"COUNTIF(L86:R86,\">0\")","v":0},{"$f":"AL27+AL36","v":0},{"$f":"J27","v":0},{"$f":"J36","v":0},{"$f":"IF(T86=0,0,MAX(0,(S86-T86)*Stundentafel!$T$2))","v":0},{"$f":"IF(U86+V86=0,0,U86/(U86+V86)*W86)","v":0},{"$f":"(W86-X86)","v":0},{"$f":"X86*Z87","v":0},{"$f":"Y86*AA87","v":0}]
[null,null,null,null,null,null,{"$f":"MIN(C86,E84)/E84","v":0},{"$f":"IF(D86=0,0,HLOOKUP(F86,Parameter!$I$61:$K$62,2,TRUE))*D86","v":0},null,null,null,null,null,null,null,null,null,null,null,null,null,null,null,null,null,{"$f":"MIN(U86,Parameter!Q39)/Parameter!Q39","v":0},{"$f":"MIN(V86,Parameter!Q40)/Parameter!Q40","v":0}]
["Fremdsprache (Abitur)",null,null,null,null,null,null,null,null,null,null,null,null,null,null,null,null,null,null,null,null,null,null,null,null,null,null,null,null,{"$f":"Parameter!J64","v":12}]
[null,null,null,null,null,null,null,null,null,null,null,null,null,"Anteilige Zählung",null,{"$f":"Parameter!J64","v":12},null,null,null,null,null,"Gruppen (ohne Shuffling)",null,null,null,null,null,null,"insgesamt",null,null,null,null,null,"Basis",null,null,null,null,null,"Aufschlag"]
[null,null,"L","F","It","Sp","Ru","Ges","Max","Anzahl","shuffle","1. Max",null,"L","F","It","Sp","Ru","Ges",null,null,"L","F","It","Sp","Ru","Ges",null,"Teiler","Gruppen","LWS","FOS","BOS",null,"Schüler","Gruppen","LWS","FOS","BOS",null,"Gruppen","LWS","FOS","BOS"]
["12",null,{"$f":"'VUÜ-SK'!E69","v":0},{"$f":"'VUÜ-SK'!F69","v":0},{"$f":"'VUÜ-SK'!G69","v":0},{"$f":"'VUÜ-SK'!H69","v":0},{"$f":"'VUÜ-SK'!I69","v":0},{"$f":"SUM(C91:G91)","v":0},{"$f":"MAX(C91:G91)","v":0},{"$f":"COUNTIF(C91:G91,I91)","v":5},{"$f":"SUMPRODUCT((C91:G91<Parameter!$J$64)*(C91:G91))","v":0},{"$f":"INDEX(C90:G90,MATCH(I91,C91:G91,0))","v":"L"},null,{"$f":"MIN($P$89,C91)/$P$89","v":0},{"$f":"MIN($P$89,D91)/$P$89","v":0},0,0,0,{"$f":"SUM(N91:R91)","v":0},null,null,{"$f":"ROUNDUP(C91/$AC91,0)","v":0},{"$f":"ROUNDUP(D91/$AC91,0)","v":0},0,0,0,{"$f":"SUM(V91:Z91)","v":0},null,{"$f":"Parameter!M20","v":25},{"$f":"AA91","v":0},{"$f":"Stundentafel!$R$2*SUMPRODUCT(N91:R91,V91:Z91)","v":0},{"$f":"IF(SUM(J37,J29)=0,0,J29/SUM(J37,J29)*AE91)","v":0},{"$f":"AE91-AF91","v":0},null,{"$f":"H91","v":0},{"$f":"ROUNDUP(AI91/AC91,0)*MIN(AI91,$AD$88)/$AD$88","v":0},{"$f":"AJ91*Stundentafel!$R$2","v":0},{"$f":"IF(SUM(J37,J29)=0,0,J29/SUM(J37,J29)*AK91)","v":0},{"$f":"AK91-AL91","v":0},null,{"$f":"AD91-AJ91","v":0},0,0,0]
["13",null,{"$f":"'VUÜ-SK'!E70","v":0},{"$f":"'VUÜ-SK'!F70","v":0},{"$f":"'VUÜ-SK'!G70","v":0},{"$f":"'VUÜ-SK'!H70","v":0},{"$f":"'VUÜ-SK'!I70","v":0},{"$f":"SUM(C92:G92)","v":0},{"$f":"MAX(C92:G92)","v":0},{"$f":"COUNTIF(C92:G92,I92)","v":5},{"$f":"SUMPRODUCT((C92:G92<Parameter!$J$64)*(C92:G92))","v":0},{"$f":"INDEX(C90:G90,MATCH(I92,C92:G92,0))","v":"L"},null,{"$f":"MIN($P$89,C92)/$P$89","v":0},0,0,0,0,{"$f":"SUM(N92:R92)","v":0},null,null,{"$f":"ROUNDUP(C92/$AC92,0)","v":0},0,0,0,0,{"$f":"SUM(V92:Z92)","v":0},null,{"$f":"Parameter!N20","v":25},{"$f":"AA92","v":0},{"$f":"Stundentafel!$R$2*SUMPRODUCT(N92:R92,V92:Z92)","v":0},{"$f":"IF(SUM(J38,J30)=0,0,J30/SUM(J38,J30)*AE92)","v":0},{"$f":"AE92-AF92","v":0},null,{"$f":"H92","v":0},{"$f":"ROUNDUP(AI92/AC92,0)*MIN(AI92,$AD$88)/$AD$88","v":0},{"$f":"AJ92*Stundentafel!$R$2","v":0},{"$f":"IF(SUM(J38,J30)=0,0,J30/SUM(J38,J30)*AK92)","v":0},{"$f":"AK92-AL92","v":0},null,0,0,0,0]
["Summe",null,{"$f":"SUM(C91:C92)","v":0},{"$f":"SUM(D91:D92)","v":0},0,0,0,0,0,null,0,null,null,0,0,0,0,0,0,null,null,0,0,0,0,0,0,null,50,0,0,{"$f":"SUM(AF91:AF92)","v":0},{"$f":"SUM(AG91:AG92)","v":0},null,{"$f":"SUM(AI91:AI92)","v":0},{"$f":"SUM(AJ91:AJ92)","v":0},{"$f":"SUM(AK91:AK92)","v":0},{"$f":"SUM(AL91:AL92)","v":0},{"$f":"SUM(AM91:AM92)","v":0},null,{"$f":"SUM(AO91:AO92)","v":0},{"$f":"SUM(AP91:AP92)","v":0},{"$f":"SUM(AQ91:AQ92)","v":0},{"$f":"SUM(AR91:AR92)","v":0}]
[]
[]
["gemeinsame Beschulung FOS13/BOS13",null,null,null,null,null,null,null,null,null,null,null,null,null,null,null,null,null,null,null,null,null,null,null,null,null,null,null,null,null,"Vergleichswert bei gemeinsamer Beschulung FOS/BOS13",null,null,null,null,null,null,null,null,"allgbild Fächer",null,null,null,"Reli",null,"Profilfächer (getrennt, Einrichtung erst ab 8 Schülern) - ohne Nat (W, IW, G) oder FSpr-IW",null,null,null,null,null,null,null,null,null,null,null,null,null,null,"zzgl. Nat",null,null,"zzgl. IW",null,"FOS/BOS13",null,null,"Profilbereich (Einsparpotenzial durch Auflösung Splittergruppen - rein Profil), alle Schulen",null,null,null,null,null,null,null,null,null,null,"Trennung der Einsparpotenziale",null,null,null,{"$f":"SUM(U99:V99)>0","v":false},null,null,null,{"$f":"BZ99=1","v":false}]
[null,"Schüler (FOS)",null,null,null,null,null,null,null,null,"Schüler (BOS)",null,null,null,null,null,null,null,null,null,"Splittergruppen",null,null,"Stundentafel",null,"zzgl. Religion",null,"IW","bish. Budget",null,"Schüler zusammen ",null,null,null,null,null,null,null,null,null,{"$f":"Stundentafel!U2","v":12},{"$f":"Stundentafel!V2","v":5},{"$f":"Stundentafel!W2","v":5},null,null,{"$f":"Stundentafel!X2","v":10},{"$f":"Stundentafel!Y2","v":8},{"$f":"Stundentafel!Z2","v":10},{"$f":"Stundentafel!AA2","v":8},{"$f":"Stundentafel!AB2","v":10},{"$f":"Stundentafel!AC2","v":5},{"$f":"Stundentafel!AD2","v":10},{"$f":"AT97","v":10},{"$f":"AU97","v":8},10,8,10,5,10,null,{"$f":"Stundentafel!AE2","v":2},{"$f":"BI97","v":2},null,{"$f":"Stundentafel!Q60","v":3},{"$f":"Parameter!J58","v":2},null,null,null,null,"(Profil ohne IW)",null,null,null,null,null,null,null,null,null,null,null,null,null,"Splittergruppenabbau",null,null,null,"gemeinsame Beschulung"]
[null,"T","W","S","G","A","IW","GP","FOS 13","Klassen","T","W","S","G","A","IW","GP","BOS 13","Klassen",null,"Splitter_FOS","Splitter_BOS",null,"Stdfl_FOS","Stdfl_BOS","Reli_FOS","Reli_BOS","IW-insg","Referenz",null,"T","W","S","G","A","IW","GP","FOBOS13",null,"Gruppen","D/E/G+Sk","M(T)","M(NT)","Reli",null,"T","W","S","G","A","IW","GP",{"$f":"AT98","v":"T"},{"$f":"AU98","v":"W"},"S","G","A","IW","GP",null,"Nat-FOS","Nat-BOS",null,"FSpr-IW","IW-Zusatz","gemeinsam","Einspar1",null,"Referenz","P13-FOS","P13-BOS","gekappt","FOS","BOS","Splitter","Einspar2","zus. Einsp","klein",null,"Einsparung","FOS","BOS",null,"Splitter","FOS","BOS",null,"Besch","FOS","BOS"]
["13",{"$f":"C30","v":0},{"$f":"D30","v":0},0,0,0,0,0,{"$f":"SUM(B99:H99)","v":0},{"$f":"AL30","v":0},{"$f":"C40","v":0},{"$f":"D40","v":0},0,0,0,0,0,{"$f":"SUM(K99:Q99)","v":0},{"$f":"AL40","v":0},null,{"$f":"SUMPRODUCT(($B99:$H99>0)*($B99:$H99<Parameter!$J$66)*1)","v":0},{"$f":"SUMPRODUCT(($K99:$Q99>0)*($K99:$Q99<Parameter!$J$66)*1)","v":0},null,{"$f":"AK30","v":0},{"$f":"AK40","v":0},{"$f":"CU30","v":0},{"$f":"CU40","v":0},{"$f":"SUM(E63:F63,E67:F67)","v":0},{"$f":"SUM(X99:AB99)","v":0},null,{"$f":"B99+K99","v":0},{"$f":"C99+L99","v":0},0,0,0,0,0,0,null,{"$f":"ROUNDUP(AL99/Parameter!$N$20,0)","v":0},{"$f":"AN99*AO97","v":0},{"$f":"ROUNDUP(SUM(AE99:AE99)/Parameter!$N$20,0)*AP97","v":0},{"$f":"ROUNDUP(SUM(AF99:AK99)/Parameter!$N$20,0)*AQ97","v":0},{"$f":"ER30","v":0},null,{"$f":"IF(B99>=Parameter!$J$66,ROUNDUP(B99/Parameter!$N$20,0),0)*AT$97","v":0},{"$f":"IF(C99>=Parameter!$J$66,ROUNDUP(C99/Parameter!$N$20,0),0)*AU$97","v":0},{"$f":"IF(D99>=Parameter!$J$66,ROUNDUP(D99/Parameter!$N$20,0),0)*AV$97","v":0},{"$f":"IF(E99>=Parameter!$J$66,ROUNDUP(E99/Parameter!$N$20,0),0)*AW$97","v":0},{"$f":"IF(F99>=Parameter!$J$66,ROUNDUP(F99/Parameter!$N$20,0),0)*AX$97","v":0},{"$f":"IF(G99>=Parameter!$J$66,ROUNDUP(G99/Parameter!$N$20,0),0)*AY$97","v":0},{"$f":"IF(H99>=Parameter!$J$66,ROUNDUP(H99/Parameter!$N$20,0),0)*AZ$97","v":0},{"$f":"IF(K99>=Parameter!$J$66,ROUNDUP(K99/Parameter!$N$20,0),0)*BA$97","v":0},{"$f":"IF(L99>=Parameter!$J$66,ROUNDUP(L99/Parameter!$N$20,0),0)*BB$97","v":0},{"$f":"IF(M99>=Parameter!$J$66,ROUNDUP(M99/Parameter!$N$20,0),0)*BC$97","v":0},{"$f":"IF(N99>=Parameter!$J$66,ROUNDUP(N99/Parameter!$N$20,0),0)*BD$97","v":0},{"$f":"IF(O99>=Parameter!$J$66,ROUNDUP(O99/Parameter!$N$20,0),0)*BE$97","v":0},{"$f":"IF(P99>=Parameter!$J$66,ROUNDUP(P99/Parameter!$N$20,0),0)*BF$97","v":0},{"$f":"IF(Q99>=Parameter!$J$66,ROUNDUP(Q99/Parameter!$N$20,0),0)*BG$97","v":0},null,{"$f":"ROUNDUP(SUM(IF(C99>=Parameter!$J$66,C99,0),IF(G99>=Parameter!$J$66,G99,0),IF(E99>=Parameter!$J$66,E99,0))/Parameter!$N$20,0)*BI$97","v":0},{"$f":"ROUNDUP(SUM(IF(L99>=Parameter!$J$66,L99,0),IF(P99>=Parameter!$J$66,P99,0),IF(N99>=Parameter!$J$66,N99,0))/Parameter!$N$20,0)*BJ$97","v":0},null,{"$f":"ROUNDUP(SUM(IF(G99>=Parameter!$J$66,G99,0),IF(P99>=Parameter!$J$66,P99,0))/Parameter!$N$20,0)*BL$97","v":0},{"$f":"IF(AND(BL99/BL97>0,BL99/BL97<=BM97),1*BL97,0)","v":0},{"$f":"IF(AL99<Parameter!J66,0,SUM(AO99,AP99,AQ99,AR99,AT99:BG99,BI99:BJ99,BL99:BM99))","v":0},{"$f":"BN99-AC99","v":0},null,{"$f":"SUM(AB99,BR99:BS99)","v":0},{"$f":"SUMPRODUCT(AC30:AI30,Stundentafel!$B$17:$H$17)+IF(L30=0,0,INDEX(Stundentafel!$I$17:$AX$17,L30))+IF(M30=0,0,INDEX(Stundentafel!$I$17:$AX$17,M30))+IF(N30=0,0,INDEX(Stundentafel!$I$17:$AX$17,N30))","v":0},{"$f":"SUMPRODUCT(AC40:AI40,Stundentafel!$B$17:$H$17)+IF(L40=0,0,INDEX(Stundentafel!$I$17:$AX$17,L40))+IF(M40=0,0,INDEX(Stundentafel!$I$17:$AX$17,M40))+IF(N40=0,0,INDEX(Stundentafel!$I$17:$AX$17,N40))","v":0},{"$f":"SUM(BU99:BV99)","v":0},{"$f":"BT100","v":0},{"$f":"BT101","v":0},{"$f":"IF(SUM(U99:V99)>0,\"x\",\"\")","v":""},{"$f":"BT99-BQ99","v":0},{"$f":"AND(BQ99<>BT99,BW99=\"\")","v":false},{"$f":"IF(OR(AND(I99>0,I99<Parameter!$J$67),AND(R99>0,R99<Parameter!$J$67)),1,0)","v":0},null,{"$f":"CF99:CH99+CJ99:CL99","v":0},0,0,null,{"$f":"SUM(CG99:CH99)","v":0},{"$f":"BX100*$CF$96","v":0},{"$f":"BX101*$CF$96","v":0},null,{"$f":"(BO99-CF99)*$CJ$96","v":0},{"$f":"ROUND(IF(SUM(I99,R99)=0,0,I99/SUM(I99,R99)*CJ99),0)","v":0},{"$f":"CJ99-CK99","v":0}]
[null,null,null,null,null,null,null,null,null,null,null,null,null,null,null,null,null,null,null,null,null,null,null,null,null,null,"FOS",{"$f":"SUM(E63:F63)","v":0},null,null,null,null,null,null,null,null,null,null,null,null,null,null,null,null,null,null,null,null,null,null,null,null,null,null,null,null,null,null,null,null,null,null,null,null,null,null,null,"FOS",{"$f":"AB100+BR99","v":0},null,"FOS",{"$f":"SUM(AT99:AZ99,BI99,BL103)","v":0},null,null,"FOS",{"$f":"BT100-BQ100","v":0},null,null,null,null,null,null,null,"(nach Sart trennbar)",null,null,null,"nach Schülerzahl getrennt)"]
[null,null,null,null,null,null,null,null,null,null,null,null,null,null,null,null,null,null,null,null,null,null,null,null,null,null,"BOS",{"$f":"SUM(E67:F67)","v":0},null,null,null,null,null,null,null,null,null,null,null,null,null,null,null,null,null,null,null,null,null,null,null,null,null,null,null,null,null,null,null,null,null,null,null,"getrennt (IW) mit Kappung!",null,null,null,"BOS",{"$f":"AB101+BS99","v":0},null,"BOS",{"$f":"SUM(BA99:BG99,BJ99,BM103)","v":0},null,null,"BOS",0]
[null,null,null,null,null,null,null,null,null,null,null,null,null,null,null,null,null,null,null,null,null,null,null,null,null,null,null,null,null,null,null,null,null,null,null,null,null,null,null,null,null,null,null,null,null,null,null,null,null,null,null,null,null,null,null,null,null,null,null,null,null,null,null,"FOS","BOS"]
[null,null,null,null,null,null,null,null,null,null,null,null,null,null,null,null,null,null,null,null,null,null,null,null,null,null,null,null,null,null,null,null,null,null,null,null,null,null,null,null,null,null,null,null,null,null,null,null,null,null,null,null,null,null,null,null,null,null,null,null,null,null,null,{"$f":"IF(G99>=Parameter!$J$66,SUM(E63:F63),0)","v":0},{"$f":"IF(P99>=Parameter!$J$66,SUM(E67:F67),0)","v":0}]
[]
[]
[]
[]
["Ausdifferenzierung nach Jahrgangsstufen"]
[null,null,null,null,null,null,null,"FOS",null,null,null,null,null,null,null,"BOS"]
[null,null,null,null,null,null,null,"Vorkurs","Vorklasse",11,12,13,"DBFH","S",null,{"$f":"H110","v":"Vorkurs"},{"$f":"I110","v":"Vorklasse"},11,12,13,"DBFH","S"]
[{"$f":"'VUÜ-Budget'!A57","v":"1.1. Stundentafel (ohne WPF, 2. FSpr, FöUnt; RU/Eth, Spo)"},null,null,null,null,null,null,{"$f":"TRANSPOSE(BA26:BAM30)","v":0},0,0,0,0,0,{"$f":"SUM(H111:M111)","v":0},{"$f":"N111='VUÜ-Budget'!H57","v":true},{"$f":"BA35","v":0},{"$f":"BA36","v":0},null,{"$f":"SUM(BA37:BA39)","v":0},{"$f":"BA40","v":0},0,{"$f":"SUM(P111:U111)","v":0},{"$f":"V111='VUÜ-Budget'!I57","v":true}]
[{"$f":"'VUÜ-Budget'!A58","v":"1.2. Förderunterricht der Stundentafel (FOS 11)"},null,null,null,null,null,null,null,null,{"$f":"EV28","v":0},null,null,null,{"$f":"SUM(I112:M112)","v":0},{"$f":"N112='VUÜ-Budget'!H58","v":true},null,null,null,null,null,null,{"$f":"SUM(P112:U112)","v":0},{"$f":"V112='VUÜ-Budget'!I58","v":true}]
[{"$f":"'VUÜ-Budget'!A59","v":"1.3. Wahlpflichtfächer-Grundbedarf 12 (ohne FSpr/Abi)"},null,null,null,null,null,null,null,null,null,{"$f":"AJ49","v":0},null,null,{"$f":"SUM(H113:M113)","v":0},{"$f":"N113='VUÜ-Budget'!H59","v":true},null,null,null,{"$f":"AK49","v":0},null,null,0,{"$f":"V113='VUÜ-Budget'!I59","v":true}]
[{"$f":"'VUÜ-Budget'!A60","v":"1.4. Wahlpflichtfächer-Grundbedarf 13 (ohne FSpr/Abi. Seminar)"},null,null,null,null,null,null,null,null,null,null,{"$f":"AJ50","v":0},null,0,{"$f":"N114='VUÜ-Budget'!H60","v":true},null,null,null,null,{"$f":"AK50","v":0},null,0,{"$f":"V114='VUÜ-Budget'!I60","v":true}]
[{"$f":"'VUÜ-Budget'!A61","v":"1.5. WPF Fremdsprache zur Hochschulreife - Grundbedarf"},null,null,null,null,null,null,null,null,null,{"$f":"AL91","v":0},{"$f":"AL92","v":0},null,0,{"$f":"N115='VUÜ-Budget'!H61","v":true},null,null,null,{"$f":"AM91","v":0},{"$f":"AM92","v":0},null,0,{"$f":"V115='VUÜ-Budget'!I61","v":true}]
[{"$f":"'VUÜ-Budget'!A62","v":"1.6. Profilfach Fremdsprache ABR IW - Grundbedarf"},null,null,null,null,null,null,null,null,{"$f":"TRANSPOSE(H61:H63)","v":0},0,0,null,0,{"$f":"N116='VUÜ-Budget'!H62","v":true},null,null,null,{"$f":"SUM(H64:H66)","v":0},{"$f":"H67","v":0},null,0,{"$f":"V116='VUÜ-Budget'!I62","v":true}]
[{"$f":"'VUÜ-Budget'!A63","v":"1.7. Grundbedarf Seminar gem. §17 FOBOS (Jgst. 13)"},null,null,null,null,null,null,null,null,null,null,{"$f":"W44","v":0},null,0,{"$f":"N117='VUÜ-Budget'!H63","v":true},null,null,null,null,{"$f":"X44","v":0},null,0,{"$f":"V117='VUÜ-Budget'!I63","v":true}]
[{"$f":"'VUÜ-Budget'!A64","v":"1.8. DBFH (1.-3. Ausbildungsjahr); FOS-Stunden"},null,null,null,null,null,null,null,null,null,null,null,{"$f":"L81","v":0},0,{"$f":"N118='VUÜ-Budget'!H64","v":true},null,null,null,null,null,null,0,{"$f":"V118='VUÜ-Budget'!I64","v":true}]
[{"$f":"'VUÜ-Budget'!A65","v":"1.9. Integrationsvorklasse (Grundbedarf)"},null,null,null,null,null,null,null,{"$f":"E86","v":0},null,null,null,null,0,{"$f":"N119='VUÜ-Budget'!H65","v":true},null,null,null,null,null,null,0,{"$f":"V119='VUÜ-Budget'!I65","v":true}]
[{"$f":"'VUÜ-Budget'!A66","v":"1.10. Reduktion für Splittergruppen-Profile in Jgst. 13"},null,null,null,null,null,null,null,null,null,null,null,null,0,{"$f":"N120='VUÜ-Budget'!H66","v":true},null,null,null,null,null,null,0,{"$f":"V120='VUÜ-Budget'!I66","v":true}]
[{"$f":"'VUÜ-Budget'!A67","v":"1.11. Einsparung durch gemeinsame Beschulung FOS13/BOS13 "},null,null,null,null,null,null,null,null,null,null,null,null,0,{"$f":"N121='VUÜ-Budget'!H67","v":true},null,null,null,null,null,null,0,{"$f":"V121='VUÜ-Budget'!I67","v":true}]
["2.1. Vorklasse: weitere Teilungen im Profilbereich",null,null,null,null,null,null,null,{"$f":"Z86","v":0},null,null,null,null,{"$f":"SUM(H122:M122)","v":0},{"$f":"N122='VUÜ-Budget'!H72","v":true},null,{"$f":"AA86","v":0},null,null,null,null,0,{"$f":"V122='VUÜ-Budget'!I72","v":true}]
["2.2. Teilungsstunden in Profilfächern",null,null,null,null,null,null,null,null,null,null,null,null,0,{"$f":"SUM(N124:N130)='VUÜ-Budget'!H73","v":true},null,null,null,null,null,null,0,{"$f":"SUM(V124:V130)='VUÜ-Budget'!I73","v":true}]
[{"$f":"TRANSPOSE(K98:Q98)","v":"T"},"ABR Technik",null,null,null,null,null,null,null,{"$f":"TRANSPOSE(BM47:BS49)","v":0},0,0,null,0,null,null,null,null,{"$f":"TRANSPOSE(BM63:BS64)","v":0},0,null,0]
["W","ABR Wirtschaft und Verwaltung",null,null,null,null,null,null,null,0,0,0,null,0,null,null,null,null,0,0,null,0]
["S","ABR Sozialwesen",null,null,null,null,null,null,null,0,0,0,null,0,null,null,null,null,0,0,null,0]
["G","ABR Gestaltung",null,null,null,null,null,null,null,0,0,0,null,0,null,null,null,null,0,0,null,0]
["A","ABR Agrarwirtschaft, Bio- und Umwellttechnologie",null,null,null,null,null,null,null,0,0,0,null,0,null,null,null,null,0,0,null,0]
["IW","ABR Internationale Wirtschaft",null,null,null,null,null,null,null,0,0,0,null,0,null,null,null,null,0,0,null,0]
["GP","ABR Gesundheit",null,null,null,null,null,null,null,0,0,0,null,0,null,null,null,null,0,0,null,0]
["2.3. Gruppenbildung Religion/Ethik",null,null,null,null,null,null,null,{"$f":"TRANSPOSE(CU27:CU30)","v":0},0,0,0,null,0,{"$f":"N131='VUÜ-Budget'!H74","v":true},null,{"$f":"CU36","v":0},null,{"$f":"SUM(CU37:CU39)","v":0},{"$f":"CU40","v":0},null,0,{"$f":"V131='VUÜ-Budget'!I74","v":true}]
["2.4. Sportklassenbildung",null,null,null,null,null,null,null,null,null,{"$f":"CA29","v":0},null,null,0,{"$f":"N132='VUÜ-Budget'!H75","v":true},null,null,null,null,null,null,0,{"$f":"V132='VUÜ-Budget'!I75","v":true}]
["2.5. Teilungen Praxisanteile WPF Informatik",null,null,null,null,null,null,null,null,null,{"$f":"L54","v":0},{"$f":"L56","v":0},null,0,{"$f":"N133='VUÜ-Budget'!H76","v":true},null,null,null,{"$f":"L55","v":0},{"$f":"L57","v":0},null,0,{"$f":"V133='VUÜ-Budget'!I76","v":true}]
["2.6. WPF Fremdsprache allg. Hochschulreife - Zusatzbedarf",null,null,null,null,null,null,null,null,null,{"$f":"AQ91","v":0},{"$f":"AQ92","v":0},null,0,{"$f":"N134='VUÜ-Budget'!H77","v":true},null,null,null,{"$f":"AR91","v":0},{"$f":"AR92","v":0},null,0,{"$f":"V134='VUÜ-Budget'!I77","v":true}]
["2.7. Profilfach Fremdsprache ABR IW - Zusatzbedarf",null,null,null,null,null,null,null,null,{"$f":"TRANSPOSE(I61:I63)","v":0},0,0,null,0,{"$f":"N135='VUÜ-Budget'!H78","v":true},null,null,null,{"$f":"SUM(I64:I66)","v":0},0,null,0,{"$f":"V135='VUÜ-Budget'!I78","v":true}]
["3.1. Ergänzungsunterricht (ohne FOS11/BOS12)",null,null,null,null,null,null,null,{"$f":"TRANSPOSE(DQ27:DQ30)","v":0},0,0,0,null,0,{"$f":"N136='VUÜ-Budget'!H83","v":true},null,{"$f":"DQ36","v":0},null,{"$f":"SUM(DQ37:DQ39)","v":0},{"$f":"DQ40","v":0},null,0,{"$f":"V136='VUÜ-Budget'!I83","v":true}]
["3.2. Differenzierungen, pädagog. Teilungen",null,null,null,null,null,null,null,{"$f":"TRANSPOSE(EB27:EB30)","v":0},0,0,0,null,0,{"$f":"N137='VUÜ-Budget'!H84","v":true},null,{"$f":"EB36","v":0},null,{"$f":"SUM(EB37:EB39)","v":0},{"$f":"EB40","v":0},null,0,{"$f":"V137='VUÜ-Budget'!I84","v":true}]
["3.3. Teilung Förderunterricht FOS 11 (WPF)",null,null,null,null,null,null,null,null,{"$f":"J112","v":0},null,null,null,0,{"$f":"N138='VUÜ-Budget'!H85","v":true},null,null,null,null,null,null,0,{"$f":"V138='VUÜ-Budget'!I85","v":true}]
["3.4. \"Intensivierungsstunden\" BOS 12",null,null,null,null,null,null,null,null,null,null,null,null,0,{"$f":"N139='VUÜ-Budget'!H86","v":true},null,null,null,{"$f":"SUM(EV37:EV39)","v":0},null,null,0,{"$f":"V139='VUÜ-Budget'!I86","v":true}]
["3.5. Wahlunterricht",null,null,null,null,null,null,null,{"$f":"TRANSPOSE(ED27:ED30)","v":0},0,0,0,null,0,{"$f":"N140='VUÜ-Budget'!H87","v":true},null,{"$f":"ED36","v":0},null,{"$f":"SUM(ED37:ED39)","v":0},{"$f":"ED40","v":0},null,0,{"$f":"V140='VUÜ-Budget'!I87","v":true}]
["3.6. Wahlfreiheitszuschlag in Wahlpflichtfächern (12/13)",null,null,null,null,null,null,null,null,null,{"$f":"AM49","v":0},{"$f":"AM50","v":0},null,0,{"$f":"N141='VUÜ-Budget'!H88","v":true},null,null,null,{"$f":"AN49","v":0},{"$f":"AN50","v":0},null,0,{"$f":"V141='VUÜ-Budget'!I88","v":true}]
["3.7. freiwillige Wahl eines zusätzlichen WPF (12/13)",null,null,null,null,null,null,null,null,null,{"$f":"AP49","v":0},{"$f":"AP50","v":0},null,0,{"$f":"N142='VUÜ-Budget'!H89","v":true},null,null,null,{"$f":"AQ49","v":0},{"$f":"AQ50","v":0},null,0,{"$f":"V142='VUÜ-Budget'!I89","v":true}]
["3.8. Zuschlag für Seminare gem. § 17 FOBOSO",null,null,null,null,null,null,null,null,null,null,{"$f":"Z44","v":0},null,0,{"$f":"N143='VUÜ-Budget'!H90","v":true},null,null,null,null,{"$f":"AA44","v":0},null,0,{"$f":"V143='VUÜ-Budget'!I90","v":true}]
["3.9. individuelle Förderung Integrationsvorklasse ",null,null,null,null,null,null,null,{"$f":"G86","v":0},null,null,null,null,0,{"$f":"N144='VUÜ-Budget'!H91","v":true},null,null,null,null,null,null,0,{"$f":"V144='VUÜ-Budget'!I91","v":true}]
["4.1. fachpraktische Tätigkeit",null,null,null,null,null,null,null,null,{"$f":"J73","v":0},null,null,null,0,{"$f":"N145='VUÜ-Budget'!H96","v":true},null,null,null,null,null,null,0,{"$f":"V145='VUÜ-Budget'!I96","v":true}]
["4.2. fachpraktische Anleitung",null,null,null,null,null,null,null,null,{"$f":"M71","v":0},null,null,null,0,{"$f":"N146='VUÜ-Budget'!H97","v":true},null,null,null,null,null,null,0,{"$f":"V146='VUÜ-Budget'!I97","v":true}]
["4.3.1. fachpraktische Vertiefung (Grundbedarf)",null,null,null,null,null,null,null,null,{"$f":"N71","v":0},null,null,null,0,{"$f":"N147='VUÜ-Budget'!H98","v":true},null,null,null,null,null,null,0,{"$f":"V147='VUÜ-Budget'!I98","v":true}]
["4.3.2. fachpraktische Vertiefung (Teilungsmehrbedarf)",null,null,null,null,null,null,null,null,{"$f":"AB71","v":0},null,null,null,0,{"$f":"N148='VUÜ-Budget'!H99","v":true},null,null,null,null,null,null,0,{"$f":"V148='VUÜ-Budget'!I99","v":true}]
["4.4. fachpraktische Betreuung",null,null,null,null,null,null,null,null,{"$f":"R71","v":0},null,null,null,0,{"$f":"N149='VUÜ-Budget'!H100","v":true},null,null,null,null,null,null,0,{"$f":"V149='VUÜ-Budget'!I100","v":true}]
[null,null,null,null,null,null,null,{"$f":"SUM(H111:H149)","v":0},{"$f":"SUM(I111:I149)","v":0},0,0,{"$f":"SUM(L111:L149)","v":0},0,0,null,0,0,0,0,0,0,0,null,{"$f":"V150+N150","v":0}]
["Für Schuljahr 2018/19: Faktorenbudget in Jahrgangsstufe 13",null,null,null,null,null,null,null,null,null,null,{"$f":"(VLOOKUP(I11,faktorenbudget,2,TRUE)+VLOOKUP(I11,faktorenbudget,3,TRUE)*(I11-VLOOKUP(I11,faktorenbudget,4,TRUE)))*(MIN(8,I11)/8)","v":0},null,null,null,null,null,null,null,{"$f":"(VLOOKUP(I20,faktorenbudget,2,TRUE)+VLOOKUP(I20,faktorenbudget,3,TRUE)*(I20-VLOOKUP(I20,faktorenbudget,4,TRUE)))*(MIN(8,I20)/8)","v":0}]

{"sheet":"Parameter","index":6,"n_rows":89,"n_cols":28,"rows_kept":89,"cut":false,"hidden":true,"merged":[[11,6,12,6],[11,7,12,7],[9,6,10,6],[9,7,10,7],[0,6,0,7],[3,14,3,17],[4,6,4,7],[7,6,8,6],[7,7,8,7],[5,6,6,6],[5,7,6,7],[69,8,69,9],[69,10,69,11],[13,6,14,6],[13,7,14,7],[17,6,18,6],[23,7,24,7],[27,7,28,7]]}
["Zentrale Parametersetzungen",null,null,null,null,null,"Modell",null,"Schulart","Vorklasse","Vorkurs",11,12,13,null,null,null,null,null,null,null,null,"Standardquote für Religionsunterricht"]
[null,null,null,null,null,null,"Schuljahr","2023/24","Vorjahr",{"$f":"LEFT(schuljahr,4)-1&\"/\"&TEXT(RIGHT(schuljahr,2)-1,\"00\")","v":"2022/23"},null,null,null,null,null,null,null,null,null,null,null,null,"als Ersatzwerte, falls keine schulbezogenen Werte ermittelbar"]
[null,null,null,null,null,null,"Auswahl des Modells",null,"Klassenteiler"]
["tiefe",2,null,null,null,null,"Modell 1",null,null,null,null,null,null,null,"Reli/Ethik, Sport, Ku/Mu",null,null,null,null,null,null,null,"Auswertung ASD 2016/17 (Bayern) - Jgst VS-12-13"]
["symmetrie",8,null,null,null,null,"Modell",null,"Schulart","Vorklasse","Vorkurs","11","12","13","NF_VS","NF_11","NF_12","NF_13","Seminar",null,null,null,"FOS","rk","ev","sonst","Ethik"]
[null,null,null,null,null,null,"Mod 1","Standardmodell","FOS",30,32,28,25,25,28,{"$f":"$O$6","v":28},28,28,15,null,null,null,"absolut",9936,4389,2,7189,{"$f":"SUM(X6:AA6)","v":21516}]
[null,null,null,null,null,null,null,null,"BOS",30,32,"x",25,25,{"$f":"$O$6","v":28},28,28,28,15,null,null,null,"relativ",{"$f":"X6/$AB$6","v":0.46179587283881762},{"$f":"Y6/$AB$6","v":0.20398773006134968},{"$f":"Z6/$AB$6","v":9.295408068414203E-5},{"$f":"AA6/$AB$6","v":0.33412344301914854},{"$f":"AB6/$AB$6","v":1}]
[null,null,null,null,null,null,"Mod 2","Ungünstiger-Modell","FOS",32,32,28,28,25,28,{"$f":"$O$8","v":28},28,28,15]
[null,null,null,null,null,null,null,null,"BOS",32,32,"x",28,25,{"$f":"$O$8","v":28},28,28,28,15,null,null,null,"Auswertung ASD 2016/17 (Bayern) - Jgst VS-12-13"]
["Faktorenmodell",null,null,null,null,null,"Mod 3","Faktorenmodell","FOS",25,30,30,27,24,{"$f":"J10","v":25},{"$f":"L10","v":30},27,24,15,null,null,null,"BOS","rk","ev","sonst","Ethik"]
["S","ErgUnt","Diff",null,null,null,null,null,"BOS",30,30,"x",30,24,{"$f":"J11","v":30},"x",30,24,15,null,null,null,"absolut",4531,1392,0,2232,{"$f":"SUM(X11:AA11)","v":8155}]
[0,0,0,null,null,null,"Mod 4","Teiler 28 \nin allen Jahrgangsstufen","FOS",28,28,28,28,28,28,28,28,28,15,null,null,null,"relativ",{"$f":"X11/$AB$11","v":0.55561005518087059},{"$f":"Y11/$AB$11","v":0.17069282648681791},0,0.27369711833231147,{"$f":"SUM(X12:AA12)","v":1}]
[1,{"$f":"B20","v":0.25},{"$f":"C20","v":0.25},null,null,null,null,null,"BOS",28,28,"x",28,28,28,28,28,28,15]
[{"$f":"A13+1","v":2},{"$f":"B13","v":0.25},{"$f":"C13","v":0.25},null,null,null,"Mod 5","Teiler 25\nin allen Jahrgangsstufen ","FOS",25,25,25,25,25,25,{"$f":"$O$14","v":25},25,25,15]
[{"$f":"A14+1","v":3},{"$f":"B14","v":0.25},0.25,null,null,null,null,null,"BOS",25,25,"x",25,25,{"$f":"$O$14","v":25},25,25,25,15]
[4,0.25,0.25,null,null,null,null,null,null,null,null,null,null,null,"VS","11","12","13"]
[5,0.25,0.25,null,null,null,null,null,null,{"$f":"J5","v":"Vorklasse"},{"$f":"K5","v":"Vorkurs"},{"$f":"L5","v":"11"},{"$f":"M5","v":"12"},{"$f":"N5","v":"13"},{"$f":"O5","v":"NF_VS"},"NF_11","NF_12","NF_13",{"$f":"S5","v":"Seminar"},"fpA","Int-VK"]
[6,0.25,0.25,null,null,null,"Auswahl",null,"FOS",{"$f":"CHOOSE(VALUE(RIGHT($G$4,1)),J6,J8,J10,J12,J14)","v":30},{"$f":"CHOOSE(VALUE(RIGHT($G$4,1)),K6,K8,K10,K12,K14)","v":32},28,25,25,28,28,28,28,{"$f":"CHOOSE(VALUE(RIGHT($G$4,1)),S6,S8,S10,S12,S14)","v":15},19,25]
[7,0.25,0.25,null,null,null,null,null,"BOS",{"$f":"CHOOSE(VALUE(RIGHT($G$4,1)),J7,J9,J11,J13,J15)","v":30},32,"x",25,25,28,28,28,28,{"$f":"CHOOSE(VALUE(RIGHT($G$4,1)),S7,S9,S11,S13,S15)","v":15}]
[8,0.25,0.25,null,null,null,null,null,"für gemeinsame Beschulung",null,null,null,{"$f":"MAX(M18:M19)","v":25},25,28,28,28,28,15]
[9,0.25,0.25]
[10,0.25,0.25,null,null,null," "]
[11,0.25,0.25,null,null,null,null,null,"Schulart","Vorklasse","Vorkurs",11,12,13,"FSpr.","Sem."]
[12,0.25,0.25,null,null,null,null,"implizite Teiler nach Faktoren-Budget","FOS",{"$f":"J10:N11","v":25},30,30,27,24,30,15]
[13,0.25,0.25,null,null,null,null,null,"BOS",30,30,"x",30,24,30,15]
[14,0.25,0.25]
[15,0.25,0.25,null,null,null,null,null,"Schulart","Vorklasse","Vorkurs",11,12,13,"FSpr.","Sem."]
[16,0.25,0.25,null,null,null,null,"Mindestschülerzahlen für die Budgetzumessung","FOS",15,12,15,14,"8/16",8,"x"]
[17,0.25,0.25,null,null,null,null,null,"BOS",13,12,"x",13,"8/16",8,"x"]
[18,0.25,0.25]
[19,{"$f":"B30","v":0.25},0.25]
[20,0.25,0.5,null,null,null,"Mindestschülerzahl für 2 Vorklassen (FOS)",null,null,400]
[21,{"$f":"B32","v":0.25},0.5]
[22,0.25,0.5,null,null,null,"Gruppengröße (2-Schienen-Modell)",null,null,19]
[23,0.25,0.5,null,null,null,"Mindestgröße für Teilung",null,null,20]
[24,0.25,0.5,null,null,null,"Mindestgröße Sport",null,null,12]
[25,0.5,0.75,null,null,null,"Mindestgröße Religion/Ethik",null,null,5,null,null,null,null,"V3-Vorgabewerte"]
[26,{"$f":"B37","v":0.5},{"$f":"C37","v":0.75},null,null,null,"Mindestgrößen",null,null,"Vkurs","Vklasse","IVK","fpU",null,null,"Vkurs","Vklasse","IVK","fpU"]
[27,{"$f":"B38","v":0.5},{"$f":"C38","v":0.75},null,null,null,null,null,"FOS",0,0,8,8,null,"FOS",12,15,8,8]
[28,0.5,1,null,null,null,null,null,"BOS",0,0,null,null,null,"BOS",12,12]
[29,{"$f":"B40","v":0.5},{"$f":"C40","v":1}]
[30,{"$f":"B41","v":0.5},1,null,null,null,"Seminarzuschlag",null,"Größenzuschlag",null,null,"Zuschlag kleine Schulen"]
[31,0.5,1,null,null,null,null,null,0,0,null,"unter",5]
[32,0.5,1,null,null,null,null,null,14,0]
[33,0.5,1,null,null,null,null,null,14.5,1]
[34,0.5,1]
[35,0.5,1]
[36,0.5,1,null,null,null,"Wahlpflichtfächer",null,"Größenzuschlag",null,null,"Zuschlag für kleine Schulen"]
[37,0.5,1,null,null,null,null,null,0,0,null,"unter",10,"Jgst. 12"]
[38,0.5,1,null,null,null,null,null,{"$f":"Q20-1","v":27},1,null,"unter",5,"Jgst. 13"]
[39,0.5,1,null,null,null,null,null,{"$f":"Q20-0.5","v":27.5},2]
[40,0.5,1]
[41,0.5,1,null,null,null,"Überbelegungsquote (WPF)",null,0.2]
[42,0.5,1]
[43,0.5,1,null,null,null,"Informatik-WPF-Quoten",null,"T","W","S","A","G","IW","GP"]
[44,0.5,1,null,null,null,"Belegungsquote","Jgst. 12",0.75,0,0.25,0.25,0.25,0.5,0.25]
[45,0.5,1,null,null,null,null,"Jgst. 13",0.75,0.5,0.25,0.25,0.25,0.5,0.25]
[46,{"$f":"B57","v":0.5},1,null,null,null,"Zuschlag-IW nach Zügigkeit",null,"bis",2]
[47,0.5,1]
[48,0.5,1,null,null,null,"Teilungsbedarfe in IV nach Klassendurchschnitt"]
[49,0.5,1,null,null,null,null,"Schnitt (ab)",0,20,22.5]
[50,0.5,1,null,null,null,null,"Zuschlag",6,7,8]
[]
["ab Æ",0,18.5,23.5,26.5,null,"Fremdsprachenminimum (Shuffling)",null,null,12]
["ErgUnt",0.25,0.25,0.5,{"$f":"D65","v":0.5}]
["Differenz.",0.25,{"$f":"B66+0.25","v":0.5},{"$f":"C66+0.25","v":0.75},{"$f":"D66+0.25","v":1},null,"Splittergruppengrenze (für Einrichtung)",null,null,8]
[null,null,null,null,null,null,"Einsparungsgrenze",null,null,20]
[]
["Vergabe von Ergänzungsunterricht und Differenzierung",null,null,null,null,null,null,null,"Wahlunterricht für"]
["FOS","VS","11","12","12_1","12_2","13",null,"FOS",null,"BOS"]
["ErgUnt",1,0,1,1,1,1,null,"VS",1,"VS",1]
["Diff",1,1,1,1,1,1,null,"11",1,"12",1]
[null,null,null,null,null,null,null,null,"12",0,"12_1",1]
["BOS","VS","11","12","12_1","12_2","13",null,"13",0,"12_2",1]
["ErgUnt",1,0,0,0,0,1,null,null,null,"13",0]
["Diff",1,0,1,1,1,1]
[]
[]
[]
["Budgetparameter FOS13/BOS13"]
["Schüler","LWS"]
[17,{"$f":"VLOOKUP(A82,faktorenbudget,2,TRUE)+VLOOKUP(A82,faktorenbudget,3,TRUE)*(A82-VLOOKUP(A82,faktorenbudget,4,TRUE))","v":34.15}]
[]
["bis","Sockel","Faktor","Basisschüler"]
[0,{"$f":"B86","v":23},0,{"$f":"A85","v":0}]
[8,23,0,{"$f":"A86","v":8}]
[16,34,0.15,{"$f":"A87","v":16}]
[25,59,1.27,24]
[73,120,1.56,72]

{"sheet":"Stundentafel","index":7,"n_rows":148,"n_cols":51,"rows_kept":148,"cut":false,"hidden":true,"merged":[[51,20,51,25],[70,10,70,12],[67,13,67,19],[68,14,68,19],[69,10,69,12],[68,10,68,12],[67,10,67,12]]}
["FOS/BOS",null,"FOS","BOS","Sem","WPF","FöU-FOS11","Teilung","BOS12","fpU","fpA-r","fpA-M","fpV-r","fpV-M","fpB-S","fpB-B","IV-Gru","FSpAbi","WU","Vkl-Zu","D/E/G+Sk","M(T)","M(NT)","T","W","S","G","A","IW","GP","Nat13"]
["Vorklasse",null,{"$f":"33-V55","v":32},{"$f":"33-Y55","v":32},2,2,1,1,2,17,1,2,1,2,{"$f":"3/40","v":7.4999999999999997E-2},{"$f":"3/40","v":7.4999999999999997E-2},36,4,0.04,3,12,5,5,10,8,10,8,10,5,10,2]
["Vorkurs",null,3,6,null,null,null,null,{"$f":"INT((I5-1)/($C$20-1))+1","v":1},{"$f":"INT((J5-1)/($C$20-1))+1","v":1},1,1,1,1,2,2,2,2,2,2,3,3,3,3,3,3,4,4,4,4,4,4,5,5,5,5,5,5,6,6,6,6,6,6,7,7,7,7,7,7]
[null,null,null,null,null,null,null,null,{"$f":"MOD(I5-1,$C$20-1)+1+IF(MOD(I5-1,$C$20-1)+1>=I3,1,0)","v":2},{"$f":"MOD(J5-1,$C$20-1)+1+IF(MOD(J5-1,$C$20-1)+1>=J3,1,0)","v":3},4,5,6,7,1,3,4,5,6,7,1,2,4,5,6,7,1,2,3,5,6,7,1,2,3,4,6,7,1,2,3,4,5,7,1,2,3,4,5,6]
["FOS","T","W","S","G","A","IW","GP",{"$f":"TRANSPOSE(A22:A63)","v":1},2,3,4,5,6,7,8,9,10,11,12,13,14,15,16,17,18,19,20,21,22,23,24,25,26,27,28,29,30,31,32,33,34,35,36,37,38,39,40,41,42]
[11,{"$f":"OFFSET($L$22,I$5+($A6-11)*10,I$5)","v":16},16,16,16,16,14,16,{"$f":"OFFSET($L$22,I$3+($A6-11)*10,I$4)","v":26},26,26,26,24,26,26,23,23,23,{"$f":"OFFSET($L$22,S$3+($A6-11)*10,S$4)","v":19},23,26,23,23,23,21,23,26,23,{"$f":"OFFSET($L$22,AC$3+($A6-11)*10,AC$4)","v":23},23,21,23,26,23,23,23,21,23,{"$f":"OFFSET($L$22,AM$3+($A6-11)*10,AM$4)","v":24},19,21,21,21,21,26,23,23,23,23,21]
[12,26,26,26,26,26,23,26,42,42,42,42,39,42,42,38,36,38,33,38,42,38,38,38,35,38,42,36,38,38,33,38,42,38,38,38,35,38,39,33,35,33,35,35,42,38,38,38,38,35]
[13,27,27,27,27,27,24,27,42,42,42,42,39,42,42,37,35,37,32,37,42,37,37,37,34,37,42,35,37,37,32,37,42,37,37,37,34,37,39,32,34,32,34,34,42,37,37,37,37,34]
["fpA",1,1,1,1,1,1,1,2,{"$f":"I9","v":2},{"$f":"J9","v":2},2,2,2,2,2,2,2,2,2,2,2,2,2,2,2,2,2,2,2,2,2,2,2,2,2,2,2,2,2,2,2,2,2,2,2,2,2,2,2]
["FöU-FO",1,{"$f":"B10","v":1},1,1,1,1,1,1,{"$f":"I10","v":1},{"$f":"J10","v":1},{"$f":"K10","v":1},{"$f":"L10","v":1},{"$f":"M10","v":1},{"$f":"N10","v":1},{"$f":"O10","v":1},{"$f":"P10","v":1},{"$f":"Q10","v":1},{"$f":"R10","v":1},{"$f":"S10","v":1},{"$f":"T10","v":1},{"$f":"U10","v":1},{"$f":"V10","v":1},{"$f":"W10","v":1},{"$f":"X10","v":1},{"$f":"Y10","v":1},{"$f":"Z10","v":1},{"$f":"AA10","v":1},{"$f":"AB10","v":1},{"$f":"AC10","v":1},{"$f":"AD10","v":1},{"$f":"AE10","v":1},{"$f":"AF10","v":1},{"$f":"AG10","v":1},{"$f":"AH10","v":1},{"$f":"AI10","v":1},{"$f":"AJ10","v":1},{"$f":"AK10","v":1},{"$f":"AL10","v":1},{"$f":"AM10","v":1},{"$f":"AN10","v":1},{"$f":"AO10","v":1},{"$f":"AP10","v":1},{"$f":"AQ10","v":1},{"$f":"AR10","v":1},{"$f":"AS10","v":1},{"$f":"AT10","v":1},{"$f":"AU10","v":1},{"$f":"AV10","v":1},{"$f":"AW10","v":1}]
["FöU-BO",2,2,2,2,2,2,2,2,{"$f":"I11","v":2},{"$f":"J11","v":2},{"$f":"K11","v":2},{"$f":"L11","v":2},{"$f":"M11","v":2},{"$f":"N11","v":2},{"$f":"O11","v":2},{"$f":"P11","v":2},{"$f":"Q11","v":2},{"$f":"R11","v":2},{"$f":"S11","v":2},{"$f":"T11","v":2},{"$f":"U11","v":2},{"$f":"V11","v":2},{"$f":"W11","v":2},{"$f":"X11","v":2},{"$f":"Y11","v":2},{"$f":"Z11","v":2},{"$f":"AA11","v":2},{"$f":"AB11","v":2},{"$f":"AC11","v":2},{"$f":"AD11","v":2},{"$f":"AE11","v":2},{"$f":"AF11","v":2},{"$f":"AG11","v":2},{"$f":"AH11","v":2},{"$f":"AI11","v":2},{"$f":"AJ11","v":2},{"$f":"AK11","v":2},{"$f":"AL11","v":2},{"$f":"AM11","v":2},{"$f":"AN11","v":2},{"$f":"AO11","v":2},{"$f":"AP11","v":2},{"$f":"AQ11","v":2},{"$f":"AR11","v":2},{"$f":"AS11","v":2},{"$f":"AT11","v":2},{"$f":"AU11","v":2},{"$f":"AV11","v":2},{"$f":"AW11","v":2}]
["BOS",null,null,null,null,null,null,null,{"$f":"TRANSPOSE(J22:J63)","v":"T_W"},"T_S","T_G","T_A","T_IW","T_GP","W_T","W_S","W_G","W_A","W_IW","W_GP","S_T","S_W","S_G","S_A","S_IW","S_GP","G_T","G_W","G_S","G_A","G_IW","G_GP","A_T","A_W","A_S","A_G","A_IW","A_GP","IW_T","IW_W","IW_S","IW_G","IW_A","IW_GP","GP_T","GP_W","GP_S","GP_G","GP_A","GP_IW"]
[12,{"$f":"OFFSET($AC$22,I$5+(ROW()-ROW($A$13))*10,I$5)","v":31},31,31,31,31,28,31,{"$f":"OFFSET($AC$22,I$3+(ROW()-ROW($A$13))*10,I$4)","v":49},49,49,49,46,49,49,44,42,44,{"$f":"OFFSET($AC$22,S$3+(ROW()-ROW($A$13))*10,S$4)","v":39},44,49,44,44,44,41,44,49,42,{"$f":"OFFSET($AC$22,AC$3+(ROW()-ROW($A$13))*10,AC$4)","v":44},44,39,44,49,44,44,44,41,44,{"$f":"OFFSET($AC$22,AM$3+(ROW()-ROW($A$13))*10,AM$4)","v":46},39,41,39,41,41,49,44,44,44,44,41]
["12_1",15.5,15.5,15.5,15.5,15.5,14,15.5,24.5,24.5,24.5,24.5,23,24.5,24.5,22,21,22,19.5,22,24.5,22,22,22,20.5,22,24.5,21,22,22,19.5,22,24.5,22,22,22,20.5,22,23,19.5,20.5,19.5,20.5,20.5,24.5,22,22,22,22,20.5]
["12_2",15.5,15.5,15.5,15.5,15.5,14,15.5,24.5,24.5,24.5,24.5,23,24.5,24.5,22,21,22,19.5,22,24.5,22,22,22,20.5,22,24.5,21,22,22,19.5,22,24.5,22,22,22,20.5,22,23,19.5,20.5,19.5,20.5,20.5,24.5,22,22,22,22,20.5]
[13,27,27,27,27,27,24,27,42,42,42,42,39,42,42,37,35,37,32,37,42,37,37,37,34,37,42,35,37,37,32,37,42,37,37,37,34,37,39,32,34,32,34,34,42,37,37,37,37,34]
["P13",{"$f":"OFFSET($AC$22,I$5+(ROW()-ROW($A$13))*10,I$5)","v":10},{"$f":"OFFSET($AC$22,J$5+(ROW()-ROW($A$13))*10,J$5)","v":10},10,10,10,7,10,{"$f":"OFFSET($AC$22,I$3+(ROW()-ROW($A$13))*10,I$4)","v":20},{"$f":"OFFSET($AC$22,J$3+(ROW()-ROW($A$13))*10,J$4)","v":20},20,20,17,20,20,20,18,20,15,20,20,20,20,20,17,20,20,18,20,20,15,20,20,20,20,20,17,20,17,15,17,15,17,17,20,20,20,20,20,17]
[]
[null,null,null,null,null,null,null,null,null,null,null,"Stundentafeln ohne Wahlpflchtbereich, ohne Fremdsprache im Profilbereich IW, OHNE SPORT und OHNE Religion/Ethik"]
["Zweigzahl",null,7,null,null,null,null,null,null,null,null,"ohne FöU 11/WPF",null,null,"Ma T/NT getrennt",null,null,"FSpr in IW herausgelöst",null,null,null,{"$f":"IF(AND(OR($L24=\"W\",$L24=\"IW\"),OR(R$22=\"W\",R$22=\"IW\")),$Y$23,0)","v":2}]
["art","e1","e2","e1*","e2*","Teil1","Teil2",null,null,null,null,null,1,2,3,4,5,6,7,null,null,null,null,null,"W/IW",null,null,null,null,null,null,null,null,null,null,null,null,null,null,null,null,"W/IW/G"]
[1,{"$f":"INT((A22-1)/6)+1","v":1},{"$f":"MOD((A22-1),6)+1","v":1},{"$f":"INT((A22-1)/6)+1","v":1},{"$f":"IF(C22>=B22,C22+1,C22)","v":2},{"$f":"INDEX($B$5:$H$5,D22)","v":"T"},{"$f":"INDEX($B$5:$H$5,E22)","v":"W"},{"$f":"INT((A22-1)/($C$20-1))+1","v":1},{"$f":"MOD(I5-1,$C$20-1)+1+IF(MOD(I5-1,$C$20-1)+1>=I3,1,0)","v":2},{"$f":"F22&\"_\"&G22","v":"T_W"},null,"FOS 11",{"$f":"B5:H5","v":"T"},"W","S","G","A","IW","GP",null,"allg","Profil","FSpr","Ma","RL","SpRe",null,null,"BOS 12",{"$f":"M22:S22","v":"T"},"W","S","G","A","IW","GP",null,"allg","Profil","FSpr","Ma","Nat","SpRe"]
[{"$f":"A22+1","v":2},{"$f":"INT((A23-1)/6)+1","v":1},{"$f":"MOD((A23-1),6)+1","v":2},{"$f":"INT((A23-1)/6)+1","v":1},{"$f":"IF(C23>=B23,C23+1,C23)","v":3},{"$f":"INDEX($B$5:$H$5,D23)","v":"T"},{"$f":"INDEX($B$5:$H$5,E23)","v":"S"},{"$f":"INT((A23-1)/($C$20-1))+1","v":1},{"$f":"MOD(A23-1,$C$20-1)+1+IF(MOD(A23-1,$C$20-1)+1>=H23,1,0)","v":3},{"$f":"F23&\"_\"&G23","v":"T_S"},1,{"$f":"TRANSPOSE(B5:H5)","v":"T"},{"$f":"$U$23+$V$23-IF($L23=\"IW\",$W$23)","v":16},{"$f":"$U$23+2*$V$23+IF(OR($L23=\"T\",N$22=\"T\"),$X$23,0)-IF(OR($L23=\"IW\",N$22=\"IW\"),$W$23,0)-IF(AND(OR($L23=\"W\",$L23=\"IW\"),OR(N$22=\"W\",N$22=\"IW\")),$Y$23,0)","v":26},26,26,26,24,26,null,{"$f":"9-Z23","v":9},7,2,3,2,0,null,1,{"$f":"L23:L29","v":"T"},{"$f":"$AL$23+$AM$23-IF($AC23=\"IW\",$AN$23)","v":31},{"$f":"$AL$23+2*$AM$23+IF(OR($AC23=\"T\",AE$22=\"T\"),$AO$23,0)-IF(OR($AC23=\"IW\",AE$22=\"IW\"),$AN$23,0)-IF(AND(OR($AC23=\"W\",$AC23=\"IW\",$AC23=\"G\"),OR(AE$22=\"W\",AE$22=\"IW\",AE$22=\"G\")),$AP$23,0)","v":49},49,49,49,46,49,null,{"$f":"19-AQ23","v":18},13,3,5,2,{"$f":"$Y$56","v":1}]
[{"$f":"A23+1","v":3},1,3,1,4,"T","G",1,4,"T_G",2,"W",{"$f":"TRANSPOSE(N23:S23)","v":26},{"$f":"$U$23+$V$23-IF($L24=\"IW\",$W$23)","v":16},{"$f":"$U$23+2*$V$23+IF(OR($L24=\"T\",O$22=\"T\"),$X$23,0)-IF(OR($L24=\"IW\",O$22=\"IW\"),$W$23,0)-IF(AND(OR($L24=\"W\",$L24=\"IW\"),OR(O$22=\"W\",O$22=\"IW\")),$Y$23,0)","v":23},{"$f":"$U$23+2*$V$23+IF(OR($L24=\"T\",P$22=\"T\"),$X$23,0)-IF(OR($L24=\"IW\",P$22=\"IW\"),$W$23,0)-IF(AND(OR($L24=\"W\",$L24=\"IW\"),OR(P$22=\"W\",P$22=\"IW\")),$Y$23,0)","v":23},{"$f":"$U$23+2*$V$23+IF(OR($L24=\"T\",Q$22=\"T\"),$X$23,0)-IF(OR($L24=\"IW\",Q$22=\"IW\"),$W$23,0)-IF(AND(OR($L24=\"W\",$L24=\"IW\"),OR(Q$22=\"W\",Q$22=\"IW\")),$Y$23,0)","v":23},{"$f":"$U$23+2*$V$23+IF(OR($L24=\"T\",R$22=\"T\"),$X$23,0)-IF(OR($L24=\"IW\",R$22=\"IW\"),$W$23,0)-IF(AND(OR($L24=\"W\",$L24=\"IW\"),OR(R$22=\"W\",R$22=\"IW\")),$Y$23,0)","v":19},{"$f":"$U$23+2*$V$23+IF(OR($L24=\"T\",S$22=\"T\"),$X$23,0)-IF(OR($L24=\"IW\",S$22=\"IW\"),$W$23,0)-IF(AND(OR($L24=\"W\",$L24=\"IW\"),OR(S$22=\"W\",S$22=\"IW\")),$Y$23,0)","v":23},null,null,null,null,null,null,null,null,2,"W",{"$f":"TRANSPOSE(AE23:AJ23)","v":49},{"$f":"$AL$23+$AM$23-IF($AC24=\"IW\",$AN$23)","v":31},{"$f":"$AL$23+2*$AM$23+IF(OR($AC24=\"T\",AF$22=\"T\"),$AO$23,0)-IF(OR($AC24=\"IW\",AF$22=\"IW\"),$AN$23,0)-IF(AND(OR($AC24=\"W\",$AC24=\"IW\",$AC24=\"G\"),OR(AF$22=\"W\",AF$22=\"IW\",AF$22=\"G\")),$AP$23,0)","v":44},{"$f":"$AL$23+2*$AM$23+IF(OR($AC24=\"T\",AG$22=\"T\"),$AO$23,0)-IF(OR($AC24=\"IW\",AG$22=\"IW\"),$AN$23,0)-IF(AND(OR($AC24=\"W\",$AC24=\"IW\",$AC24=\"G\"),OR(AG$22=\"W\",AG$22=\"IW\",AG$22=\"G\")),$AP$23,0)","v":42},{"$f":"$AL$23+2*$AM$23+IF(OR($AC24=\"T\",AH$22=\"T\"),$AO$23,0)-IF(OR($AC24=\"IW\",AH$22=\"IW\"),$AN$23,0)-IF(AND(OR($AC24=\"W\",$AC24=\"IW\",$AC24=\"G\"),OR(AH$22=\"W\",AH$22=\"IW\",AH$22=\"G\")),$AP$23,0)","v":44},{"$f":"$AL$23+2*$AM$23+IF(OR($AC24=\"T\",AI$22=\"T\"),$AO$23,0)-IF(OR($AC24=\"IW\",AI$22=\"IW\"),$AN$23,0)-IF(AND(OR($AC24=\"W\",$AC24=\"IW\",$AC24=\"G\"),OR(AI$22=\"W\",AI$22=\"IW\",AI$22=\"G\")),$AP$23,0)","v":39},{"$f":"$AL$23+2*$AM$23+IF(OR($AC24=\"T\",AJ$22=\"T\"),$AO$23,0)-IF(OR($AC24=\"IW\",AJ$22=\"IW\"),$AN$23,0)-IF(AND(OR($AC24=\"W\",$AC24=\"IW\",$AC24=\"G\"),OR(AJ$22=\"W\",AJ$22=\"IW\",AJ$22=\"G\")),$AP$23,0)","v":44}]
[4,1,4,1,5,"T","A",1,5,"T_A",3,"S",26,{"$f":"TRANSPOSE(O24:S24)","v":23},{"$f":"$U$23+$V$23-IF($L25=\"IW\",$W$23)","v":16},{"$f":"$U$23+2*$V$23+IF(OR($L25=\"T\",P$22=\"T\"),$X$23,0)-IF(OR($L25=\"IW\",P$22=\"IW\"),$W$23,0)-IF(AND(OR($L25=\"W\",$L25=\"IW\"),OR(P$22=\"W\",P$22=\"IW\")),$Y$23,0)","v":23},{"$f":"$U$23+2*$V$23+IF(OR($L25=\"T\",Q$22=\"T\"),$X$23,0)-IF(OR($L25=\"IW\",Q$22=\"IW\"),$W$23,0)-IF(AND(OR($L25=\"W\",$L25=\"IW\"),OR(Q$22=\"W\",Q$22=\"IW\")),$Y$23,0)","v":23},{"$f":"$U$23+2*$V$23+IF(OR($L25=\"T\",R$22=\"T\"),$X$23,0)-IF(OR($L25=\"IW\",R$22=\"IW\"),$W$23,0)-IF(AND(OR($L25=\"W\",$L25=\"IW\"),OR(R$22=\"W\",R$22=\"IW\")),$Y$23,0)","v":21},{"$f":"$U$23+2*$V$23+IF(OR($L25=\"T\",S$22=\"T\"),$X$23,0)-IF(OR($L25=\"IW\",S$22=\"IW\"),$W$23,0)-IF(AND(OR($L25=\"W\",$L25=\"IW\"),OR(S$22=\"W\",S$22=\"IW\")),$Y$23,0)","v":23},null,null,null,null,null,null,null,null,3,"S",49,{"$f":"TRANSPOSE(AF24:AJ24)","v":44},{"$f":"$AL$23+$AM$23-IF($AC25=\"IW\",$AN$23)","v":31},{"$f":"$AL$23+2*$AM$23+IF(OR($AC25=\"T\",AG$22=\"T\"),$AO$23,0)-IF(OR($AC25=\"IW\",AG$22=\"IW\"),$AN$23,0)-IF(AND(OR($AC25=\"W\",$AC25=\"IW\",$AC25=\"G\"),OR(AG$22=\"W\",AG$22=\"IW\",AG$22=\"G\")),$AP$23,0)","v":44},{"$f":"$AL$23+2*$AM$23+IF(OR($AC25=\"T\",AH$22=\"T\"),$AO$23,0)-IF(OR($AC25=\"IW\",AH$22=\"IW\"),$AN$23,0)-IF(AND(OR($AC25=\"W\",$AC25=\"IW\",$AC25=\"G\"),OR(AH$22=\"W\",AH$22=\"IW\",AH$22=\"G\")),$AP$23,0)","v":44},{"$f":"$AL$23+2*$AM$23+IF(OR($AC25=\"T\",AI$22=\"T\"),$AO$23,0)-IF(OR($AC25=\"IW\",AI$22=\"IW\"),$AN$23,0)-IF(AND(OR($AC25=\"W\",$AC25=\"IW\",$AC25=\"G\"),OR(AI$22=\"W\",AI$22=\"IW\",AI$22=\"G\")),$AP$23,0)","v":41},{"$f":"$AL$23+2*$AM$23+IF(OR($AC25=\"T\",AJ$22=\"T\"),$AO$23,0)-IF(OR($AC25=\"IW\",AJ$22=\"IW\"),$AN$23,0)-IF(AND(OR($AC25=\"W\",$AC25=\"IW\",$AC25=\"G\"),OR(AJ$22=\"W\",AJ$22=\"IW\",AJ$22=\"G\")),$AP$23,0)","v":44}]
[5,1,5,1,6,"T","IW",1,6,"T_IW",4,"G",26,23,{"$f":"TRANSPOSE(P25:S25)","v":23},{"$f":"$U$23+$V$23-IF($L26=\"IW\",$W$23)","v":16},{"$f":"$U$23+2*$V$23+IF(OR($L26=\"T\",Q$22=\"T\"),$X$23,0)-IF(OR($L26=\"IW\",Q$22=\"IW\"),$W$23,0)-IF(AND(OR($L26=\"W\",$L26=\"IW\"),OR(Q$22=\"W\",Q$22=\"IW\")),$Y$23,0)","v":23},{"$f":"$U$23+2*$V$23+IF(OR($L26=\"T\",R$22=\"T\"),$X$23,0)-IF(OR($L26=\"IW\",R$22=\"IW\"),$W$23,0)-IF(AND(OR($L26=\"W\",$L26=\"IW\"),OR(R$22=\"W\",R$22=\"IW\")),$Y$23,0)","v":21},{"$f":"$U$23+2*$V$23+IF(OR($L26=\"T\",S$22=\"T\"),$X$23,0)-IF(OR($L26=\"IW\",S$22=\"IW\"),$W$23,0)-IF(AND(OR($L26=\"W\",$L26=\"IW\"),OR(S$22=\"W\",S$22=\"IW\")),$Y$23,0)","v":23},null,null,null,null,null,null,null,null,4,"G",49,42,{"$f":"TRANSPOSE(AG25:AJ25)","v":44},{"$f":"$AL$23+$AM$23-IF($AC26=\"IW\",$AN$23)","v":31},{"$f":"$AL$23+2*$AM$23+IF(OR($AC26=\"T\",AH$22=\"T\"),$AO$23,0)-IF(OR($AC26=\"IW\",AH$22=\"IW\"),$AN$23,0)-IF(AND(OR($AC26=\"W\",$AC26=\"IW\",$AC26=\"G\"),OR(AH$22=\"W\",AH$22=\"IW\",AH$22=\"G\")),$AP$23,0)","v":44},{"$f":"$AL$23+2*$AM$23+IF(OR($AC26=\"T\",AI$22=\"T\"),$AO$23,0)-IF(OR($AC26=\"IW\",AI$22=\"IW\"),$AN$23,0)-IF(AND(OR($AC26=\"W\",$AC26=\"IW\",$AC26=\"G\"),OR(AI$22=\"W\",AI$22=\"IW\",AI$22=\"G\")),$AP$23,0)","v":39},{"$f":"$AL$23+2*$AM$23+IF(OR($AC26=\"T\",AJ$22=\"T\"),$AO$23,0)-IF(OR($AC26=\"IW\",AJ$22=\"IW\"),$AN$23,0)-IF(AND(OR($AC26=\"W\",$AC26=\"IW\",$AC26=\"G\"),OR(AJ$22=\"W\",AJ$22=\"IW\",AJ$22=\"G\")),$AP$23,0)","v":44}]
[6,1,6,1,7,"T","GP",1,7,"T_GP",5,"A",26,23,23,{"$f":"TRANSPOSE(Q26:S26)","v":23},{"$f":"$U$23+$V$23-IF($L27=\"IW\",$W$23)","v":16},{"$f":"$U$23+2*$V$23+IF(OR($L27=\"T\",R$22=\"T\"),$X$23,0)-IF(OR($L27=\"IW\",R$22=\"IW\"),$W$23,0)-IF(AND(OR($L27=\"W\",$L27=\"IW\"),OR(R$22=\"W\",R$22=\"IW\")),$Y$23,0)","v":21},{"$f":"$U$23+2*$V$23+IF(OR($L27=\"T\",S$22=\"T\"),$X$23,0)-IF(OR($L27=\"IW\",S$22=\"IW\"),$W$23,0)-IF(AND(OR($L27=\"W\",$L27=\"IW\"),OR(S$22=\"W\",S$22=\"IW\")),$Y$23,0)","v":23},null,null,null,null,null,null,null,null,5,"A",49,44,44,{"$f":"TRANSPOSE(AH26:AJ26)","v":44},{"$f":"$AL$23+$AM$23-IF($AC27=\"IW\",$AN$23)","v":31},{"$f":"$AL$23+2*$AM$23+IF(OR($AC27=\"T\",AI$22=\"T\"),$AO$23,0)-IF(OR($AC27=\"IW\",AI$22=\"IW\"),$AN$23,0)-IF(AND(OR($AC27=\"W\",$AC27=\"IW\",$AC27=\"G\"),OR(AI$22=\"W\",AI$22=\"IW\",AI$22=\"G\")),$AP$23,0)","v":41},{"$f":"$AL$23+2*$AM$23+IF(OR($AC27=\"T\",AJ$22=\"T\"),$AO$23,0)-IF(OR($AC27=\"IW\",AJ$22=\"IW\"),$AN$23,0)-IF(AND(OR($AC27=\"W\",$AC27=\"IW\",$AC27=\"G\"),OR(AJ$22=\"W\",AJ$22=\"IW\",AJ$22=\"G\")),$AP$23,0)","v":44}]
[7,2,1,2,1,"W","T",2,1,"W_T",6,"IW",24,19,21,21,{"$f":"TRANSPOSE(R27:S27)","v":21},{"$f":"$U$23+$V$23-IF($L28=\"IW\",$W$23)","v":14},{"$f":"$U$23+2*$V$23+IF(OR($L28=\"T\",S$22=\"T\"),$X$23,0)-IF(OR($L28=\"IW\",S$22=\"IW\"),$W$23,0)-IF(AND(OR($L28=\"W\",$L28=\"IW\"),OR(S$22=\"W\",S$22=\"IW\")),$Y$23,0)","v":21},null,null,null,null,null,null,null,null,6,"IW",46,39,41,39,{"$f":"TRANSPOSE(AI27:AJ27)","v":41},{"$f":"$AL$23+$AM$23-IF($AC28=\"IW\",$AN$23)","v":28},{"$f":"$AL$23+2*$AM$23+IF(OR($AC28=\"T\",AJ$22=\"T\"),$AO$23,0)-IF(OR($AC28=\"IW\",AJ$22=\"IW\"),$AN$23,0)-IF(AND(OR($AC28=\"W\",$AC28=\"IW\",$AC28=\"G\"),OR(AJ$22=\"W\",AJ$22=\"IW\",AJ$22=\"G\")),$AP$23,0)","v":41}]
[8,2,2,2,3,"W","S",2,3,"W_S",7,"GP",26,23,23,23,23,{"$f":"TRANSPOSE(S28)","v":21},{"$f":"$U$23+$V$23-IF($L29=\"IW\",$W$23)","v":16},null,null,null,null,null,null,null,null,7,"GP",49,44,44,44,44,{"$f":"TRANSPOSE(AJ28)","v":41},{"$f":"$AL$23+$AM$23-IF($AC29=\"IW\",$AN$23)","v":31}]
[9,2,3,2,4,"W","G",2,4,"W_G"]
[10,2,4,2,5,"W","A",2,5,"W_A",null,null,1,2,3,4,5,6,7,null,null,null,null,null,"W/IW/G",null,null,null,null,1,2,3,4,5,6,7]
[11,2,5,2,6,"W","IW",2,6,"W_IW",null,"FOS 12",{"$f":"M22:S22","v":"T"},"W","S","G","A","IW","GP",null,"allg","Profil","FSpr","Ma","Nat","SpRe",null,null,"BOS 12_1",{"$f":"AD22:AJ22","v":"T"},"W","S","G","A","IW","GP",null,"allg","Profil","FSpr","Ma","Nat"]
[12,2,6,2,7,"W","GP",2,7,"W_GP",1,{"$f":"$L$23:$L$29","v":"T"},{"$f":"$U$33+$V$33-IF($L33=\"IW\",$W$33)","v":26},{"$f":"$U$33+2*$V$33+IF(OR($L33=\"T\",N$22=\"T\"),$X$33,0)-IF(OR($L33=\"IW\",N$22=\"IW\"),$W$33,0)-IF(AND(OR($L33=\"W\",$L33=\"IW\",$L33=\"G\"),OR(N$32=\"W\",N$32=\"IW\",N$32=\"G\")),$Y$33,0)","v":42},42,42,42,39,42,null,{"$f":"18-Z33","v":14},12,3,4,2,{"$f":"SUM($V$57:$W$57)","v":4},null,1,{"$f":"$L$23:$L$29","v":"T"},{"$f":"AD23:AJ29/2","v":15.5},24.5,24.5,24.5,24.5,23,24.5]
[13,3,1,3,1,"S","T",3,1,"S_T",2,"W",{"$f":"TRANSPOSE(N33:S33)","v":42},{"$f":"$U$33+$V$33-IF($L34=\"IW\",$W$33)","v":26},{"$f":"$U$33+2*$V$33+IF(OR($L34=\"T\",O$22=\"T\"),$X$33,0)-IF(OR($L34=\"IW\",O$22=\"IW\"),$W$33,0)-IF(AND(OR($L34=\"W\",$L34=\"IW\",$L34=\"G\"),OR(O$32=\"W\",O$32=\"IW\",O$32=\"G\")),$Y$33,0)","v":38},{"$f":"$U$33+2*$V$33+IF(OR($L34=\"T\",P$22=\"T\"),$X$33,0)-IF(OR($L34=\"IW\",P$22=\"IW\"),$W$33,0)-IF(AND(OR($L34=\"W\",$L34=\"IW\",$L34=\"G\"),OR(P$32=\"W\",P$32=\"IW\",P$32=\"G\")),$Y$33,0)","v":36},{"$f":"$U$33+2*$V$33+IF(OR($L34=\"T\",Q$22=\"T\"),$X$33,0)-IF(OR($L34=\"IW\",Q$22=\"IW\"),$W$33,0)-IF(AND(OR($L34=\"W\",$L34=\"IW\",$L34=\"G\"),OR(Q$32=\"W\",Q$32=\"IW\",Q$32=\"G\")),$Y$33,0)","v":38},{"$f":"$U$33+2*$V$33+IF(OR($L34=\"T\",R$22=\"T\"),$X$33,0)-IF(OR($L34=\"IW\",R$22=\"IW\"),$W$33,0)-IF(AND(OR($L34=\"W\",$L34=\"IW\",$L34=\"G\"),OR(R$32=\"W\",R$32=\"IW\",R$32=\"G\")),$Y$33,0)","v":33},{"$f":"$U$33+2*$V$33+IF(OR($L34=\"T\",S$22=\"T\"),$X$33,0)-IF(OR($L34=\"IW\",S$22=\"IW\"),$W$33,0)-IF(AND(OR($L34=\"W\",$L34=\"IW\",$L34=\"G\"),OR(S$32=\"W\",S$32=\"IW\",S$32=\"G\")),$Y$33,0)","v":38},null,null,null,null,null,null,null,null,2,"W",24.5,15.5,22,21,22,19.5,22]
[14,3,2,3,2,"S","W",3,2,"S_W",3,"S",42,{"$f":"TRANSPOSE(O34:S34)","v":38},{"$f":"$U$33+$V$33-IF($L35=\"IW\",$W$33)","v":26},{"$f":"$U$33+2*$V$33+IF(OR($L35=\"T\",P$22=\"T\"),$X$33,0)-IF(OR($L35=\"IW\",P$22=\"IW\"),$W$33,0)-IF(AND(OR($L35=\"W\",$L35=\"IW\",$L35=\"G\"),OR(P$32=\"W\",P$32=\"IW\",P$32=\"G\")),$Y$33,0)","v":38},{"$f":"$U$33+2*$V$33+IF(OR($L35=\"T\",Q$22=\"T\"),$X$33,0)-IF(OR($L35=\"IW\",Q$22=\"IW\"),$W$33,0)-IF(AND(OR($L35=\"W\",$L35=\"IW\",$L35=\"G\"),OR(Q$32=\"W\",Q$32=\"IW\",Q$32=\"G\")),$Y$33,0)","v":38},{"$f":"$U$33+2*$V$33+IF(OR($L35=\"T\",R$22=\"T\"),$X$33,0)-IF(OR($L35=\"IW\",R$22=\"IW\"),$W$33,0)-IF(AND(OR($L35=\"W\",$L35=\"IW\",$L35=\"G\"),OR(R$32=\"W\",R$32=\"IW\",R$32=\"G\")),$Y$33,0)","v":35},{"$f":"$U$33+2*$V$33+IF(OR($L35=\"T\",S$22=\"T\"),$X$33,0)-IF(OR($L35=\"IW\",S$22=\"IW\"),$W$33,0)-IF(AND(OR($L35=\"W\",$L35=\"IW\",$L35=\"G\"),OR(S$32=\"W\",S$32=\"IW\",S$32=\"G\")),$Y$33,0)","v":38},null,null,null,null,null,null,null,null,3,"S",24.5,22,15.5,22,22,20.5,22]
[15,3,3,3,4,"S","G",3,4,"S_G",4,"G",42,36,{"$f":"TRANSPOSE(P35:S35)","v":38},{"$f":"$U$33+$V$33-IF($L36=\"IW\",$W$33)","v":26},{"$f":"$U$33+2*$V$33+IF(OR($L36=\"T\",Q$22=\"T\"),$X$33,0)-IF(OR($L36=\"IW\",Q$22=\"IW\"),$W$33,0)-IF(AND(OR($L36=\"W\",$L36=\"IW\",$L36=\"G\"),OR(Q$32=\"W\",Q$32=\"IW\",Q$32=\"G\")),$Y$33,0)","v":38},{"$f":"$U$33+2*$V$33+IF(OR($L36=\"T\",R$22=\"T\"),$X$33,0)-IF(OR($L36=\"IW\",R$22=\"IW\"),$W$33,0)-IF(AND(OR($L36=\"W\",$L36=\"IW\",$L36=\"G\"),OR(R$32=\"W\",R$32=\"IW\",R$32=\"G\")),$Y$33,0)","v":33},{"$f":"$U$33+2*$V$33+IF(OR($L36=\"T\",S$22=\"T\"),$X$33,0)-IF(OR($L36=\"IW\",S$22=\"IW\"),$W$33,0)-IF(AND(OR($L36=\"W\",$L36=\"IW\",$L36=\"G\"),OR(S$32=\"W\",S$32=\"IW\",S$32=\"G\")),$Y$33,0)","v":38},null,null,null,null,null,null,null,null,4,"G",24.5,21,22,15.5,22,19.5,22]
[16,3,4,3,5,"S","A",3,5,"S_A",5,"A",42,38,38,{"$f":"TRANSPOSE(Q36:S36)","v":38},{"$f":"$U$33+$V$33-IF($L37=\"IW\",$W$33)","v":26},{"$f":"$U$33+2*$V$33+IF(OR($L37=\"T\",R$22=\"T\"),$X$33,0)-IF(OR($L37=\"IW\",R$22=\"IW\"),$W$33,0)-IF(AND(OR($L37=\"W\",$L37=\"IW\",$L37=\"G\"),OR(R$32=\"W\",R$32=\"IW\",R$32=\"G\")),$Y$33,0)","v":35},{"$f":"$U$33+2*$V$33+IF(OR($L37=\"T\",S$22=\"T\"),$X$33,0)-IF(OR($L37=\"IW\",S$22=\"IW\"),$W$33,0)-IF(AND(OR($L37=\"W\",$L37=\"IW\",$L37=\"G\"),OR(S$32=\"W\",S$32=\"IW\",S$32=\"G\")),$Y$33,0)","v":38},null,null,null,null,null,null,null,null,5,"A",24.5,22,22,22,15.5,20.5,22]
[17,3,5,3,6,"S","IW",3,6,"S_IW",6,"IW",39,33,35,33,{"$f":"TRANSPOSE(R37:S37)","v":35},{"$f":"$U$33+$V$33-IF($L38=\"IW\",$W$33)","v":23},{"$f":"$U$33+2*$V$33+IF(OR($L38=\"T\",S$22=\"T\"),$X$33,0)-IF(OR($L38=\"IW\",S$22=\"IW\"),$W$33,0)-IF(AND(OR($L38=\"W\",$L38=\"IW\",$L38=\"G\"),OR(S$32=\"W\",S$32=\"IW\",S$32=\"G\")),$Y$33,0)","v":35},null,null,null,null,null,null,null,null,6,"IW",23,19.5,20.5,19.5,20.5,14,20.5]
[18,3,6,3,7,"S","GP",3,7,"S_GP",7,"GP",42,38,38,38,38,{"$f":"TRANSPOSE(S38)","v":35},{"$f":"$U$33+$V$33-IF($L39=\"IW\",$W$33)","v":26},null,null,null,null,null,null,null,null,7,"GP",24.5,22,22,22,22,20.5,15.5]
[19,4,1,4,1,"G","T",4,1,"G_T"]
[20,4,2,4,2,"G","W",4,2,"G_W",null,null,1,2,3,4,5,6,7,null,null,null,null,null,"W/IW/G",null,null,null,null,1,2,3,4,5,6,7]
[21,4,3,4,3,"G","S",4,3,"G_S",null,"FOS 13",{"$f":"M22:S22","v":"T"},"W","S","G","A","IW","GP",null,"allg","Profil","FSpr","Ma","Nat","SpRe",null,null,"BOS 12_2",{"$f":"AD22:AJ22","v":"T"},"W","S","G","A","IW","GP",null,"allg","Profil","FSpr","Ma","Nat"]
[22,4,4,4,5,"G","A",4,5,"G_A",1,{"$f":"$L$23:$L$29","v":"T"},{"$f":"$U$43+$V$43-IF($L43=\"IW\",$W$43)","v":27},{"$f":"$U$43+2*$V$43+IF(OR($L43=\"T\",N$22=\"T\"),$X$43,0)-IF(OR($L43=\"IW\",N$22=\"IW\"),$W$43,0)-IF(AND(OR($L43=\"W\",$L43=\"IW\",$L43=\"G\"),OR(N$32=\"W\",N$32=\"IW\",N$32=\"G\")),$Y$43,0)","v":42},42,42,42,39,42,null,{"$f":"18-Z43","v":17},10,3,5,2,{"$f":"SUM($V$58:$W$58)","v":1},null,1,{"$f":"$L$23:$L$29","v":"T"},{"$f":"AD23:AJ29/2","v":15.5},24.5,24.5,24.5,24.5,23,24.5]
[23,4,5,4,6,"G","IW",4,6,"G_IW",2,"W",{"$f":"TRANSPOSE(N43:S43)","v":42},{"$f":"$U$43+$V$43-IF($L44=\"IW\",$W$43)","v":27},{"$f":"$U$43+2*$V$43+IF(OR($L44=\"T\",O$22=\"T\"),$X$43,0)-IF(OR($L44=\"IW\",O$22=\"IW\"),$W$43,0)-IF(AND(OR($L44=\"W\",$L44=\"IW\",$L44=\"G\"),OR(O$32=\"W\",O$32=\"IW\",O$32=\"G\")),$Y$43,0)","v":37},{"$f":"$U$43+2*$V$43+IF(OR($L44=\"T\",P$22=\"T\"),$X$43,0)-IF(OR($L44=\"IW\",P$22=\"IW\"),$W$43,0)-IF(AND(OR($L44=\"W\",$L44=\"IW\",$L44=\"G\"),OR(P$32=\"W\",P$32=\"IW\",P$32=\"G\")),$Y$43,0)","v":35},{"$f":"$U$43+2*$V$43+IF(OR($L44=\"T\",Q$22=\"T\"),$X$43,0)-IF(OR($L44=\"IW\",Q$22=\"IW\"),$W$43,0)-IF(AND(OR($L44=\"W\",$L44=\"IW\",$L44=\"G\"),OR(Q$32=\"W\",Q$32=\"IW\",Q$32=\"G\")),$Y$43,0)","v":37},{"$f":"$U$43+2*$V$43+IF(OR($L44=\"T\",R$22=\"T\"),$X$43,0)-IF(OR($L44=\"IW\",R$22=\"IW\"),$W$43,0)-IF(AND(OR($L44=\"W\",$L44=\"IW\",$L44=\"G\"),OR(R$32=\"W\",R$32=\"IW\",R$32=\"G\")),$Y$43,0)","v":32},{"$f":"$U$43+2*$V$43+IF(OR($L44=\"T\",S$22=\"T\"),$X$43,0)-IF(OR($L44=\"IW\",S$22=\"IW\"),$W$43,0)-IF(AND(OR($L44=\"W\",$L44=\"IW\",$L44=\"G\"),OR(S$32=\"W\",S$32=\"IW\",S$32=\"G\")),$Y$43,0)","v":37},null,null,null,null,null,null,null,null,2,"W",24.5,15.5,22,21,22,19.5,22]
[24,4,6,4,7,"G","GP",4,7,"G_GP",3,"S",42,{"$f":"TRANSPOSE(O44:S44)","v":37},{"$f":"$U$43+$V$43-IF($L45=\"IW\",$W$43)","v":27},{"$f":"$U$43+2*$V$43+IF(OR($L45=\"T\",P$22=\"T\"),$X$43,0)-IF(OR($L45=\"IW\",P$22=\"IW\"),$W$43,0)-IF(AND(OR($L45=\"W\",$L45=\"IW\",$L45=\"G\"),OR(P$32=\"W\",P$32=\"IW\",P$32=\"G\")),$Y$43,0)","v":37},{"$f":"$U$43+2*$V$43+IF(OR($L45=\"T\",Q$22=\"T\"),$X$43,0)-IF(OR($L45=\"IW\",Q$22=\"IW\"),$W$43,0)-IF(AND(OR($L45=\"W\",$L45=\"IW\",$L45=\"G\"),OR(Q$32=\"W\",Q$32=\"IW\",Q$32=\"G\")),$Y$43,0)","v":37},{"$f":"$U$43+2*$V$43+IF(OR($L45=\"T\",R$22=\"T\"),$X$43,0)-IF(OR($L45=\"IW\",R$22=\"IW\"),$W$43,0)-IF(AND(OR($L45=\"W\",$L45=\"IW\",$L45=\"G\"),OR(R$32=\"W\",R$32=\"IW\",R$32=\"G\")),$Y$43,0)","v":34},{"$f":"$U$43+2*$V$43+IF(OR($L45=\"T\",S$22=\"T\"),$X$43,0)-IF(OR($L45=\"IW\",S$22=\"IW\"),$W$43,0)-IF(AND(OR($L45=\"W\",$L45=\"IW\",$L45=\"G\"),OR(S$32=\"W\",S$32=\"IW\",S$32=\"G\")),$Y$43,0)","v":37},null,null,null,null,null,null,null,null,3,"S",24.5,22,15.5,22,22,20.5,22]
[25,5,1,5,1,"A","T",5,1,"A_T",4,"G",42,35,{"$f":"TRANSPOSE(P45:S45)","v":37},{"$f":"$U$43+$V$43-IF($L46=\"IW\",$W$43)","v":27},{"$f":"$U$43+2*$V$43+IF(OR($L46=\"T\",Q$22=\"T\"),$X$43,0)-IF(OR($L46=\"IW\",Q$22=\"IW\"),$W$43,0)-IF(AND(OR($L46=\"W\",$L46=\"IW\",$L46=\"G\"),OR(Q$32=\"W\",Q$32=\"IW\",Q$32=\"G\")),$Y$43,0)","v":37},{"$f":"$U$43+2*$V$43+IF(OR($L46=\"T\",R$22=\"T\"),$X$43,0)-IF(OR($L46=\"IW\",R$22=\"IW\"),$W$43,0)-IF(AND(OR($L46=\"W\",$L46=\"IW\",$L46=\"G\"),OR(R$32=\"W\",R$32=\"IW\",R$32=\"G\")),$Y$43,0)","v":32},{"$f":"$U$43+2*$V$43+IF(OR($L46=\"T\",S$22=\"T\"),$X$43,0)-IF(OR($L46=\"IW\",S$22=\"IW\"),$W$43,0)-IF(AND(OR($L46=\"W\",$L46=\"IW\",$L46=\"G\"),OR(S$32=\"W\",S$32=\"IW\",S$32=\"G\")),$Y$43,0)","v":37},null,null,null,null,null,null,null,null,4,"G",24.5,21,22,15.5,22,19.5,22]
[26,5,2,5,2,"A","W",5,2,"A_W",5,"A",42,37,37,{"$f":"TRANSPOSE(Q46:S46)","v":37},{"$f":"$U$43+$V$43-IF($L47=\"IW\",$W$43)","v":27},{"$f":"$U$43+2*$V$43+IF(OR($L47=\"T\",R$22=\"T\"),$X$43,0)-IF(OR($L47=\"IW\",R$22=\"IW\"),$W$43,0)-IF(AND(OR($L47=\"W\",$L47=\"IW\",$L47=\"G\"),OR(R$32=\"W\",R$32=\"IW\",R$32=\"G\")),$Y$43,0)","v":34},{"$f":"$U$43+2*$V$43+IF(OR($L47=\"T\",S$22=\"T\"),$X$43,0)-IF(OR($L47=\"IW\",S$22=\"IW\"),$W$43,0)-IF(AND(OR($L47=\"W\",$L47=\"IW\",$L47=\"G\"),OR(S$32=\"W\",S$32=\"IW\",S$32=\"G\")),$Y$43,0)","v":37},null,null,null,null,null,null,null,null,5,"A",24.5,22,22,22,15.5,20.5,22]
[27,5,3,5,3,"A","S",5,3,"A_S",6,"IW",39,32,34,32,{"$f":"TRANSPOSE(R47:S47)","v":34},{"$f":"$U$43+$V$43-IF($L48=\"IW\",$W$43)","v":24},{"$f":"$U$43+2*$V$43+IF(OR($L48=\"T\",S$22=\"T\"),$X$43,0)-IF(OR($L48=\"IW\",S$22=\"IW\"),$W$43,0)-IF(AND(OR($L48=\"W\",$L48=\"IW\",$L48=\"G\"),OR(S$32=\"W\",S$32=\"IW\",S$32=\"G\")),$Y$43,0)","v":34},null,null,null,null,null,null,null,null,6,"IW",23,19.5,20.5,19.5,20.5,14,20.5]
[28,5,4,5,4,"A","G",5,4,"A_G",7,"GP",42,37,37,37,37,{"$f":"TRANSPOSE(S48)","v":34},{"$f":"$U$43+$V$43-IF($L49=\"IW\",$W$43)","v":27},null,null,null,null,null,null,null,null,7,"GP",24.5,22,22,22,22,20.5,15.5]
[29,5,5,5,6,"A","IW",5,6,"A_IW"]
[30,5,6,5,7,"A","GP",5,7,"A_GP",null,null,null,null,null,null,null,null,null,null,null,null,null,null,null,null,null,null,null,null,null,null,null,null,null,null,null,null,null,null,null,"W/IW/G"]
[31,6,1,6,1,"IW","T",6,1,"IW_T",null,null,null,null,null,"IW-Profilfach (Fremdsprache!)",null,null,null,null,"Religion-Stundentafel",null,null,null,null,null,null,null,"BOS 13",{"$f":"AD42:AJ42","v":"T"},"W","S","G","A","IW","GP",null,"allg","Profil","FSpr","Ma","Nat","SpRe"]
[32,6,2,6,2,"IW","W",6,2,"IW_W",null,null,null,null,null,"FOS/BOS",null,"BOS12",null,null,"FOS","Re","Spo","BOS","Re","Zeile",null,1,{"$f":"$L$23:$L$29","v":"T"},{"$f":"AL$53+AM$53","v":27},{"$f":"$AL$53+2*$AM$53+IF(OR($AC53=\"T\",AE$22=\"T\"),$AO$53,0)-IF(OR($AC53=\"IW\",AE$22=\"IW\"),$AN$53,0)-IF(AND(OR($AC53=\"W\",$AC53=\"IW\",$AC53=\"G\"),OR(AE$22=\"W\",AE$22=\"IW\",AE$22=\"G\")),$AP$53,0)","v":42},42,42,42,39,42,null,{"$f":"18-AQ53","v":17},10,3,5,2,{"$f":"$Y$59","v":1}]
[33,6,3,6,3,"IW","S",6,3,"IW_S",null,null,null,null,null,"VK",0,0,null,"Vorkurs","VK",0,0,"VK",0,0,null,2,"W",{"$f":"TRANSPOSE(AE53:AJ53)","v":42},{"$f":"$AD$53-IF($AC54=\"IW\",$AN$53)","v":27},{"$f":"$AL$53+2*$AM$53+IF(OR($AC54=\"T\",AF$22=\"T\"),$AO$53,0)-IF(OR($AC54=\"IW\",AF$22=\"IW\"),$AN$53,0)-IF(AND(OR($AC54=\"W\",$AC54=\"IW\",$AC54=\"G\"),OR(AF$22=\"W\",AF$22=\"IW\",AF$22=\"G\")),$AP$53,0)","v":37},{"$f":"$AL$53+2*$AM$53+IF(OR($AC54=\"T\",AG$22=\"T\"),$AO$53,0)-IF(OR($AC54=\"IW\",AG$22=\"IW\"),$AN$53,0)-IF(AND(OR($AC54=\"W\",$AC54=\"IW\",$AC54=\"G\"),OR(AG$22=\"W\",AG$22=\"IW\",AG$22=\"G\")),$AP$53,0)","v":35},{"$f":"$AL$53+2*$AM$53+IF(OR($AC54=\"T\",AH$22=\"T\"),$AO$53,0)-IF(OR($AC54=\"IW\",AH$22=\"IW\"),$AN$53,0)-IF(AND(OR($AC54=\"W\",$AC54=\"IW\",$AC54=\"G\"),OR(AH$22=\"W\",AH$22=\"IW\",AH$22=\"G\")),$AP$53,0)","v":37},{"$f":"$AL$53+2*$AM$53+IF(OR($AC54=\"T\",AI$22=\"T\"),$AO$53,0)-IF(OR($AC54=\"IW\",AI$22=\"IW\"),$AN$53,0)-IF(AND(OR($AC54=\"W\",$AC54=\"IW\",$AC54=\"G\"),OR(AI$22=\"W\",AI$22=\"IW\",AI$22=\"G\")),$AP$53,0)","v":32},{"$f":"$AL$53+2*$AM$53+IF(OR($AC54=\"T\",AJ$22=\"T\"),$AO$53,0)-IF(OR($AC54=\"IW\",AJ$22=\"IW\"),$AN$53,0)-IF(AND(OR($AC54=\"W\",$AC54=\"IW\",$AC54=\"G\"),OR(AJ$22=\"W\",AJ$22=\"IW\",AJ$22=\"G\")),$AP$53,0)","v":37}]
[34,6,4,6,4,"IW","G",6,4,"IW_G",null,null,null,null,null,"VS",0,0,null,"Vorklasse","VS",1,0,"VS",1,0,null,3,"S",42,{"$f":"TRANSPOSE(AF54:AJ54)","v":37},{"$f":"$AD$53-IF($AC55=\"IW\",$AN$53)","v":27},{"$f":"$AL$53+2*$AM$53+IF(OR($AC55=\"T\",AG$22=\"T\"),$AO$53,0)-IF(OR($AC55=\"IW\",AG$22=\"IW\"),$AN$53,0)-IF(AND(OR($AC55=\"W\",$AC55=\"IW\",$AC55=\"G\"),OR(AG$22=\"W\",AG$22=\"IW\",AG$22=\"G\")),$AP$53,0)","v":37},{"$f":"$AL$53+2*$AM$53+IF(OR($AC55=\"T\",AH$22=\"T\"),$AO$53,0)-IF(OR($AC55=\"IW\",AH$22=\"IW\"),$AN$53,0)-IF(AND(OR($AC55=\"W\",$AC55=\"IW\",$AC55=\"G\"),OR(AH$22=\"W\",AH$22=\"IW\",AH$22=\"G\")),$AP$53,0)","v":37},{"$f":"$AL$53+2*$AM$53+IF(OR($AC55=\"T\",AI$22=\"T\"),$AO$53,0)-IF(OR($AC55=\"IW\",AI$22=\"IW\"),$AN$53,0)-IF(AND(OR($AC55=\"W\",$AC55=\"IW\",$AC55=\"G\"),OR(AI$22=\"W\",AI$22=\"IW\",AI$22=\"G\")),$AP$53,0)","v":34},{"$f":"$AL$53+2*$AM$53+IF(OR($AC55=\"T\",AJ$22=\"T\"),$AO$53,0)-IF(OR($AC55=\"IW\",AJ$22=\"IW\"),$AN$53,0)-IF(AND(OR($AC55=\"W\",$AC55=\"IW\",$AC55=\"G\"),OR(AJ$22=\"W\",AJ$22=\"IW\",AJ$22=\"G\")),$AP$53,0)","v":37}]
[35,6,5,6,5,"IW","A",6,5,"IW_A",null,null,null,null,null,"11",2,2,null,null,"11",0,0,"12",1,0,null,4,"G",42,35,{"$f":"TRANSPOSE(AG55:AJ55)","v":37},{"$f":"$AD$53-IF($AC56=\"IW\",$AN$53)","v":27},{"$f":"$AL$53+2*$AM$53+IF(OR($AC56=\"T\",AH$22=\"T\"),$AO$53,0)-IF(OR($AC56=\"IW\",AH$22=\"IW\"),$AN$53,0)-IF(AND(OR($AC56=\"W\",$AC56=\"IW\",$AC56=\"G\"),OR(AH$22=\"W\",AH$22=\"IW\",AH$22=\"G\")),$AP$53,0)","v":37},{"$f":"$AL$53+2*$AM$53+IF(OR($AC56=\"T\",AI$22=\"T\"),$AO$53,0)-IF(OR($AC56=\"IW\",AI$22=\"IW\"),$AN$53,0)-IF(AND(OR($AC56=\"W\",$AC56=\"IW\",$AC56=\"G\"),OR(AI$22=\"W\",AI$22=\"IW\",AI$22=\"G\")),$AP$53,0)","v":32},{"$f":"$AL$53+2*$AM$53+IF(OR($AC56=\"T\",AJ$22=\"T\"),$AO$53,0)-IF(OR($AC56=\"IW\",AJ$22=\"IW\"),$AN$53,0)-IF(AND(OR($AC56=\"W\",$AC56=\"IW\",$AC56=\"G\"),OR(AJ$22=\"W\",AJ$22=\"IW\",AJ$22=\"G\")),$AP$53,0)","v":37}]
[36,6,6,6,7,"IW","GP",6,7,"IW_GP",null,null,null,null,null,"12",3,5,null,null,"12",2,2,"12_1",0.5,1,null,5,"A",42,37,37,{"$f":"TRANSPOSE(AH56:AJ56)","v":37},{"$f":"$AD$53-IF($AC57=\"IW\",$AN$53)","v":27},{"$f":"$AL$53+2*$AM$53+IF(OR($AC57=\"T\",AI$22=\"T\"),$AO$53,0)-IF(OR($AC57=\"IW\",AI$22=\"IW\"),$AN$53,0)-IF(AND(OR($AC57=\"W\",$AC57=\"IW\",$AC57=\"G\"),OR(AI$22=\"W\",AI$22=\"IW\",AI$22=\"G\")),$AP$53,0)","v":34},{"$f":"$AL$53+2*$AM$53+IF(OR($AC57=\"T\",AJ$22=\"T\"),$AO$53,0)-IF(OR($AC57=\"IW\",AJ$22=\"IW\"),$AN$53,0)-IF(AND(OR($AC57=\"W\",$AC57=\"IW\",$AC57=\"G\"),OR(AJ$22=\"W\",AJ$22=\"IW\",AJ$22=\"G\")),$AP$53,0)","v":37}]
[37,7,1,7,1,"GP","T",7,1,"GP_T",null,null,null,null,null,"12_1",{"$f":"Q57/2","v":1.5},{"$f":"R57/2","v":2.5},null,null,"13",1,0,"12_2",0.5,2,null,6,"IW",39,32,34,32,{"$f":"TRANSPOSE(AI57:AJ57)","v":34},{"$f":"$AD$53-IF($AC58=\"IW\",$AN$53)","v":24},{"$f":"$AL$53+2*$AM$53+IF(OR($AC58=\"T\",AJ$22=\"T\"),$AO$53,0)-IF(OR($AC58=\"IW\",AJ$22=\"IW\"),$AN$53,0)-IF(AND(OR($AC58=\"W\",$AC58=\"IW\",$AC58=\"G\"),OR(AJ$22=\"W\",AJ$22=\"IW\",AJ$22=\"G\")),$AP$53,0)","v":34}]
[38,7,2,7,2,"GP","W",7,2,"GP_W",null,null,null,null,null,"12_2",{"$f":"Q57/2","v":1.5},{"$f":"R57/2","v":2.5},null,null,null,null,null,"13",1,3,null,7,"GP",42,37,37,37,37,{"$f":"TRANSPOSE(AJ58)","v":34},{"$f":"$AD$53-IF($AC59=\"IW\",$AN$53)","v":27}]
[39,7,3,7,3,"GP","S",7,3,"GP_S",null,null,null,null,null,"13",3,3]
[40,7,4,7,4,"GP","G",7,4,"GP_G",null,null,null,null,null,null,null,null,null,null,null,null,null,null,null,null,null,null,"ohne IW-Fremdsprache; gemeinsam Nat"]
[41,7,5,7,5,"GP","A",7,5,"GP_A",null,null,null,null,null,null,null,null,null,null,null,null,null,null,null,null,null,"Profil","BOS 13",{"$f":"AD52:AJ52","v":"T"},"W","S","G","A","IW","GP"]
[42,7,6,7,6,"GP","IW",7,6,"GP_IW",null,null,null,null,null,null,null,null,null,null,null,null,null,null,null,null,null,1,{"$f":"$L$23:$L$29","v":"T"},10,{"$f":"2*$AM$53-IF(OR($AC63=\"IW\",AE$22=\"IW\"),$AN$53,0)-IF(AND(OR($AC63=\"W\",$AC63=\"IW\",$AC63=\"G\"),OR(AE$22=\"W\",AE$22=\"IW\",AE$22=\"G\")),$AP$53,0)","v":20},20,20,20,17,20]
[0,0,0,0,0,null,null,null,null,"-",null,null,null,null,null,null,null,null,null,null,null,null,null,null,null,null,null,2,"W",{"$f":"TRANSPOSE(AE63:AJ63)","v":20},{"$f":"$AD$63","v":10},{"$f":"2*$AM$53-IF(OR($AC64=\"IW\",AF$22=\"IW\"),$AN$53,0)-IF(AND(OR($AC64=\"W\",$AC64=\"IW\",$AC64=\"G\"),OR(AF$22=\"W\",AF$22=\"IW\",AF$22=\"G\")),$AP$53,0)","v":20},{"$f":"2*$AM$53-IF(OR($AC64=\"IW\",AG$22=\"IW\"),$AN$53,0)-IF(AND(OR($AC64=\"W\",$AC64=\"IW\",$AC64=\"G\"),OR(AG$22=\"W\",AG$22=\"IW\",AG$22=\"G\")),$AP$53,0)","v":18},{"$f":"2*$AM$53-IF(OR($AC64=\"IW\",AH$22=\"IW\"),$AN$53,0)-IF(AND(OR($AC64=\"W\",$AC64=\"IW\",$AC64=\"G\"),OR(AH$22=\"W\",AH$22=\"IW\",AH$22=\"G\")),$AP$53,0)","v":20},{"$f":"2*$AM$53-IF(OR($AC64=\"IW\",AI$22=\"IW\"),$AN$53,0)-IF(AND(OR($AC64=\"W\",$AC64=\"IW\",$AC64=\"G\"),OR(AI$22=\"W\",AI$22=\"IW\",AI$22=\"G\")),$AP$53,0)","v":15},{"$f":"2*$AM$53-IF(OR($AC64=\"IW\",AJ$22=\"IW\"),$AN$53,0)-IF(AND(OR($AC64=\"W\",$AC64=\"IW\",$AC64=\"G\"),OR(AJ$22=\"W\",AJ$22=\"IW\",AJ$22=\"G\")),$AP$53,0)","v":20}]
[null,null,null,null,null,null,null,null,null,null,null,null,null,null,null,null,null,null,null,null,null,null,null,null,null,null,null,3,"S",20,{"$f":"TRANSPOSE(AF64:AJ64)","v":20},{"$f":"$AD$63","v":10},{"$f":"2*$AM$53-IF(OR($AC65=\"IW\",AG$22=\"IW\"),$AN$53,0)-IF(AND(OR($AC65=\"W\",$AC65=\"IW\",$AC65=\"G\"),OR(AG$22=\"W\",AG$22=\"IW\",AG$22=\"G\")),$AP$53,0)","v":20},{"$f":"2*$AM$53-IF(OR($AC65=\"IW\",AH$22=\"IW\"),$AN$53,0)-IF(AND(OR($AC65=\"W\",$AC65=\"IW\",$AC65=\"G\"),OR(AH$22=\"W\",AH$22=\"IW\",AH$22=\"G\")),$AP$53,0)","v":20},{"$f":"2*$AM$53-IF(OR($AC65=\"IW\",AI$22=\"IW\"),$AN$53,0)-IF(AND(OR($AC65=\"W\",$AC65=\"IW\",$AC65=\"G\"),OR(AI$22=\"W\",AI$22=\"IW\",AI$22=\"G\")),$AP$53,0)","v":17},{"$f":"2*$AM$53-IF(OR($AC65=\"IW\",AJ$22=\"IW\"),$AN$53,0)-IF(AND(OR($AC65=\"W\",$AC65=\"IW\",$AC65=\"G\"),OR(AJ$22=\"W\",AJ$22=\"IW\",AJ$22=\"G\")),$AP$53,0)","v":20}]
[null,null,null,null,null,null,null,null,null,null,null,null,null,null,null,null,null,null,null,null,null,null,null,null,null,null,null,4,"G",20,18,{"$f":"TRANSPOSE(AG65:AJ65)","v":20},{"$f":"$AD$63","v":10},{"$f":"2*$AM$53-IF(OR($AC66=\"IW\",AH$22=\"IW\"),$AN$53,0)-IF(AND(OR($AC66=\"W\",$AC66=\"IW\",$AC66=\"G\"),OR(AH$22=\"W\",AH$22=\"IW\",AH$22=\"G\")),$AP$53,0)","v":20},{"$f":"2*$AM$53-IF(OR($AC66=\"IW\",AI$22=\"IW\"),$AN$53,0)-IF(AND(OR($AC66=\"W\",$AC66=\"IW\",$AC66=\"G\"),OR(AI$22=\"W\",AI$22=\"IW\",AI$22=\"G\")),$AP$53,0)","v":15},{"$f":"2*$AM$53-IF(OR($AC66=\"IW\",AJ$22=\"IW\"),$AN$53,0)-IF(AND(OR($AC66=\"W\",$AC66=\"IW\",$AC66=\"G\"),OR(AJ$22=\"W\",AJ$22=\"IW\",AJ$22=\"G\")),$AP$53,0)","v":20}]
[null,null,null,null,null,null,null,null,null,null,null,null,null,"T","W","S","G","A","IW","GP",null,null,null,null,null,null,null,5,"A",20,20,20,{"$f":"TRANSPOSE(AH66:AJ66)","v":20},{"$f":"$AD$63","v":10},{"$f":"2*$AM$53-IF(OR($AC67=\"IW\",AI$22=\"IW\"),$AN$53,0)-IF(AND(OR($AC67=\"W\",$AC67=\"IW\",$AC67=\"G\"),OR(AI$22=\"W\",AI$22=\"IW\",AI$22=\"G\")),$AP$53,0)","v":17},{"$f":"2*$AM$53-IF(OR($AC67=\"IW\",AJ$22=\"IW\"),$AN$53,0)-IF(AND(OR($AC67=\"W\",$AC67=\"IW\",$AC67=\"G\"),OR(AJ$22=\"W\",AJ$22=\"IW\",AJ$22=\"G\")),$AP$53,0)","v":20}]
[null,null,null,null,null,null,null,null,null,null,"RDESkSp",null,null,14,null,null,null,null,null,null,null,null,null,null,null,null,null,6,"IW",17,15,17,15,{"$f":"TRANSPOSE(AI67:AJ67)","v":17},{"$f":"$AD$63-AN53","v":7},{"$f":"2*$AM$53-IF(OR($AC68=\"IW\",AJ$22=\"IW\"),$AN$53,0)-IF(AND(OR($AC68=\"W\",$AC68=\"IW\",$AC68=\"G\"),OR(AJ$22=\"W\",AJ$22=\"IW\",AJ$22=\"G\")),$AP$53,0)","v":17}]
[null,null,null,null,null,null,null,null,null,null,"M",null,null,4,4,null,null,null,null,null,null,null,null,null,null,null,null,7,"GP",20,20,20,20,20,{"$f":"TRANSPOSE(AJ68)","v":17},{"$f":"$AD$63","v":10}]
[null,null,null,null,null,null,null,null,null,null,"Profil (o FSpr)",null,null,12,10,12,10,12,7,12]
[null,null,null,null,null,null,null,null,null,null,"Nat",null,null,null,2,null,2,null,2]
[]
[]
[]
["Überprüfung"]
[null,null,"Profilstunden",null,null,null,null,null,null,"Hybrid einfach als allgbild + Profil 1 + Profil 2"]
["Abweichung wg. Ma-Nat!",null,null,null,null,null,null,null,"Teil 1",{"$f":"I3","v":1},1,1,1,1,1,2,2,2,2,2,2,3,3,3,3,3,3,4,4,4,4,4,4,5,5,5,5,5,5,6,6,6,6,6,6,7,7,7,7,7,7]
[null,null,null,null,null,null,null,null,"Teil 2",{"$f":"I4","v":2},3,4,5,6,7,1,3,4,5,6,7,1,2,4,5,6,7,1,2,3,5,6,7,1,2,3,4,6,7,1,2,3,4,5,7,1,2,3,4,5,6]
["FOS","allg",{"$f":"B5","v":"T"},"W","S","G","A","IW","GP",{"$f":"I5","v":1},2,3,4,5,6,7,8,9,10,11,12,13,14,15,16,17,18,19,20,21,22,23,24,25,26,27,28,29,30,31,32,33,34,35,36,37,38,39,40,41,42]
[11,{"$f":"2*INDEX($B6:$AX6,2)-INDEX($B6:$AX6,15)","v":9},{"$f":"B6-$B80","v":7},{"$f":"C6-$B80","v":7},7,7,7,5,7,{"$f":"$B80+INDEX($C80:$I80,J$77)+INDEX($C80:$I80,J$78)","v":23},{"$f":"$B80+INDEX($C80:$I80,K$77)+INDEX($C80:$I80,K$78)","v":23},23,23,21,23,23,23,23,23,21,23,23,23,23,23,21,23,23,23,23,23,21,23,23,23,23,23,21,23,21,21,21,21,21,21,23,23,23,23,23,21]
[12,{"$f":"2*INDEX($B7:$AX7,2)-INDEX($B7:$AX7,15)","v":14},{"$f":"B7-$B81","v":12},12,12,12,12,9,12,{"$f":"$B81+INDEX($C81:$I81,J$77)+INDEX($C81:$I81,J$78)","v":38},38,38,38,35,38,38,38,38,38,35,38,38,38,38,38,35,38,38,38,38,38,35,38,38,38,38,38,35,38,35,35,35,35,35,35,38,38,38,38,38,35]
[13,{"$f":"2*INDEX($B8:$AX8,2)-INDEX($B8:$AX8,15)","v":17},{"$f":"B8-$B82","v":10},10,10,10,10,7,10,37,37,37,37,34,37,37,37,37,37,34,37,37,37,37,37,34,37,37,37,37,37,34,37,37,37,37,37,34,37,34,34,34,34,34,34,37,37,37,37,37,34]
["fpA"]
["FöU-FO"]
["FöU-BO"]
["BOS"]
[12,{"$f":"2*INDEX($B13:$AX13,2)-INDEX($B13:$AX13,15)","v":18},{"$f":"B13-$B87","v":13},{"$f":"C13-$B87","v":13},13,13,13,10,13,{"$f":"$B87+INDEX($C87:$I87,J$77)+INDEX($C87:$I87,J$78)","v":44},{"$f":"$B87+INDEX($C87:$I87,K$77)+INDEX($C87:$I87,K$78)","v":44},44,44,41,44,44,44,44,44,41,44,44,44,44,44,41,44,44,44,44,44,41,44,44,44,44,44,41,44,41,41,41,41,41,41,44,44,44,44,44,41]
["12_1",{"$f":"2*INDEX($B14:$AX14,2)-INDEX($B14:$AX14,15)","v":9},{"$f":"B14-$B88","v":6.5},6.5,6.5,6.5,6.5,5,6.5,{"$f":"$B88+INDEX($C88:$I88,J$77)+INDEX($C88:$I88,J$78)","v":22},22,22,22,20.5,22,22,22,22,22,20.5,22,22,22,22,22,20.5,22,22,22,22,22,20.5,22,22,22,22,22,20.5,22,20.5,20.5,20.5,20.5,20.5,20.5,22,22,22,22,22,20.5]
["12_2",{"$f":"2*INDEX($B15:$AX15,2)-INDEX($B15:$AX15,15)","v":9},{"$f":"B15-$B89","v":6.5},6.5,6.5,6.5,6.5,5,6.5,22,22,22,22,20.5,22,22,22,22,22,20.5,22,22,22,22,22,20.5,22,22,22,22,22,20.5,22,22,22,22,22,20.5,22,20.5,20.5,20.5,20.5,20.5,20.5,22,22,22,22,22,20.5]
[13,{"$f":"2*INDEX($B16:$AX16,2)-INDEX($B16:$AX16,15)","v":17},10,10,10,10,10,7,10,37,37,37,37,34,37,37,37,37,37,34,37,37,37,37,37,34,37,37,37,37,37,34,37,37,37,37,37,34,37,34,34,34,34,34,34,37,37,37,37,37,34]
["P13"]
[]
["Trennung in gemeinsam unterrichtete Stunden und ausbildungsrichtungsbezogene Stunden"]
[]
[null,null,null,null,null,null,null,null,{"$f":"I77","v":"Teil 1"},{"$f":"J77","v":1},1,1,1,1,1,2,2,2,2,2,2,3,3,3,3,3,3,4,4,4,4,4,4,5,5,5,5,5,5,6,6,6,6,6,6,7,7,7,7,7,7]
[null,null,null,null,null,null,null,null,{"$f":"I78","v":"Teil 2"},2,3,4,5,6,7,1,3,4,5,6,7,1,2,4,5,6,7,1,2,3,5,6,7,1,2,3,4,6,7,1,2,3,4,5,7,1,2,3,4,5,6]
[null,null,null,null,null,null,null,null,null,{"$f":"INDEX($C$79:$I$79,J95)","v":"T"},{"$f":"INDEX($C$79:$I$79,K95)","v":"T"},"T","T","T","T","W","W","W","W","W","W","S","S","S","S","S","S","G","G","G","G","G","G","A","A","A","A","A","A","IW","IW","IW","IW","IW","IW","GP","GP","GP","GP","GP","GP"]
["FOS",null,"T","W","S","G","A","IW","GP",{"$f":"INDEX($C$79:$I$79,J96)","v":"W"},"S","G","A","IW","GP","T","S","G","A","IW","GP","T","W","G","A","IW","GP","T","W","S","A","IW","GP","T","W","S","G","IW","GP","T","W","S","G","A","GP","T","W","S","G","A","IW"]
["gemeinsam",null,null,null,null,null,null,null,"T-Anteil",{"$f":"OR(J95=1,J96=1)","v":true},{"$f":"OR(K95=1,K96=1)","v":true},true,true,true,true,true,false,false,false,false,false,true,false,false,false,false,false,true,false,false,false,false,false,true,false,false,false,false,false,true,false,false,false,false,false,true,false,false,false,false,false]
[{"$f":"A80","v":11},null,{"$f":"$U$23","v":9},{"$f":"$U$23","v":9},9,9,9,9,9,{"$f":"$U$23-IF(J$99,$X$23,0)+IF(AND(OR(J$95=2,J$95=6),OR(J$96=2,J$96=6)),$Y$23,0)","v":6},{"$f":"$U$23-IF(K$99,$X$23,0)+IF(AND(OR(K$95=2,K$95=6),OR(K$96=2,K$96=6)),$Y$23,0)","v":6},6,6,6,6,6,9,9,9,11,9,6,9,9,9,9,9,6,9,9,9,9,9,6,9,9,9,9,9,6,11,9,9,9,9,6,9,9,9,9,9]
[{"$f":"A81","v":12},null,{"$f":"$U$33","v":14},{"$f":"$U$33","v":14},14,14,14,14,14,{"$f":"$U$33-IF(J$99,$X$33,0)+IF(AND(OR(J$95=2,J$95=4,J$95=6),OR(J$96=2,J$96=4,J$96=6)),$Y$33,0)","v":10},{"$f":"$U$33-IF(K$99,$X$33,0)+IF(AND(OR(K$95=2,K$95=4,K$95=6),OR(K$96=2,K$96=4,K$96=6)),$Y$33,0)","v":10},10,10,10,10,10,14,16,14,16,14,10,14,14,14,14,14,10,16,14,14,16,14,10,14,14,14,14,14,10,16,14,16,14,14,10,14,14,14,14,14]
[{"$f":"A82","v":13},null,{"$f":"$U$43","v":17},{"$f":"$U$43","v":17},17,17,17,17,17,{"$f":"$U$43-IF(J$99,$X$43,0)+IF(AND(OR(J$95=2,J$95=4,J$95=6),OR(J$96=2,J$96=4,J$96=6)),$Y$43,0)","v":12},{"$f":"$U$43-IF(K$99,$X$43,0)+IF(AND(OR(K$95=2,K$95=4,K$95=6),OR(K$96=2,K$96=4,K$96=6)),$Y$43,0)","v":12},12,12,12,12,12,17,19,17,19,17,12,17,17,17,17,17,12,19,17,17,19,17,12,17,17,17,17,17,12,19,17,19,17,17,12,17,17,17,17,17]
["fpAnl",null,1,{"$f":"C103","v":1},1,1,1,1,1,0,{"$f":"J103","v":0},{"$f":"K103","v":0},0,0,0,0,0,0,0,0,0,0,0,0,0,0,0,0,0,0,0,0,0,0,0,0,0,0,0,0,0,0,0,0,0,0,0,0,0,0,0]
["FörUnt",null,1,1,1,1,1,1,1,1,1,1,1,1,1,1,1,1,1,1,1,1,1,1,1,1,1,1,1,1,1,1,1,1,1,1,1,1,1,1,1,1,1,1,1,1,1,1,1,1,1]
["Profil 1"]
[{"$f":"$A$100:$A$104","v":11},null,{"$f":"$V$23-IF(C$98=\"IW\",$W$23,0)","v":7},{"$f":"$V$23-IF(D$98=\"IW\",$W$23,0)","v":7},7,7,7,5,7,{"$f":"$V$23-IF(AND(OR(J$95=2,J$95=6),OR(J$96=2,J$96=6)),$Y$23,0)-IF(J$95=6,$W$23,0)+IF(J$99,$X$23,0)","v":10},{"$f":"$V$23-IF(AND(OR(K$95=2,K$95=6),OR(K$96=2,K$96=6)),$Y$23,0)-IF(K$95=6,$W$23,0)+IF(K$99,$X$23,0)","v":10},10,10,10,10,10,7,7,7,5,7,10,7,7,7,7,7,10,7,7,7,7,7,10,7,7,7,7,7,8,3,5,5,5,5,10,7,7,7,7,7]
[12,null,{"$f":"$V$33-IF(C$98=\"IW\",$W$33,0)","v":12},{"$f":"$V$33-IF(D$98=\"IW\",$W$33,0)","v":12},12,12,12,9,12,{"$f":"$V$33-IF(AND(OR(J$95=2,J$95=4,J$95=6),OR(J$96=2,J$96=4,J$96=6)),$Y$33,0)-IF(J$95=6,$W$33,0)+IF(J$99,$X$33,0)","v":16},{"$f":"$V$33-IF(AND(OR(K$95=2,K$95=4,K$95=6),OR(K$96=2,K$96=4,K$96=6)),$Y$33,0)-IF(K$95=6,$W$33,0)+IF(K$99,$X$33,0)","v":16},16,16,16,16,16,12,10,12,10,12,16,12,12,12,12,12,16,10,12,12,10,12,16,12,12,12,12,12,13,7,9,7,9,9,16,12,12,12,12,12]
[13,null,{"$f":"$V$43-IF(C$98=\"IW\",$W$43,0)","v":10},{"$f":"$V$43-IF(D$98=\"IW\",$W$43,0)","v":10},10,10,10,7,10,{"$f":"$V$43-IF(AND(OR(J$95=2,J$95=4,J$95=6),OR(J$96=2,J$96=4,J$96=6)),$Y$43,0)-IF(J$95=6,$W$43,0)+IF(J$99,$X$43,0)","v":15},{"$f":"$V$43-IF(AND(OR(K$95=2,K$95=4,K$95=6),OR(K$96=2,K$96=4,K$96=6)),$Y$43,0)-IF(K$95=6,$W$43,0)+IF(K$99,$X$43,0)","v":15},15,15,15,15,15,10,8,10,8,10,15,10,10,10,10,10,15,8,10,10,8,10,15,10,10,10,10,10,12,5,7,5,7,7,15,10,10,10,10,10]
["fpAnl",null,0,{"$f":"C109","v":0},{"$f":"D109","v":0},0,0,0,0,1,1,1,1,1,1,1,1,1,1,1,{"$f":"T109","v":1},1,1,1,1,1,1,1,1,1,1,1,1,1,1,1,{"$f":"AJ109","v":1},1,1,1,1,1,1,1,1,1,1,1,1,1,1]
["FörUnt",null,0,{"$f":"C110","v":0},0,0,0,0,0,0,0,0,0,0,0,0,0,0,0,0,0,0,0,0,0,0,0,0,0,0,0,0,0,0,0,0,0,0,0,0,0,0,0,0,0,0,0,0,0,0,0]
["Profil 2"]
[{"$f":"$A$100:$A$104","v":11},null,0,{"$f":"C112","v":0},{"$f":"D112","v":0},0,0,0,0,{"$f":"$V$23-IF(AND(OR(J$95=2,J$95=6),OR(J$96=2,J$96=6)),$Y$23,0)-IF(J$96=6,$W$23,0)+IF(J$99,$X$23,0)","v":10},{"$f":"$V$23-IF(AND(OR(K$95=2,K$95=6),OR(K$96=2,K$96=6)),$Y$23,0)-IF(K$96=6,$W$23,0)+IF(K$99,$X$23,0)","v":10},10,10,8,10,10,7,7,7,3,7,10,7,7,7,5,7,10,7,7,7,5,7,10,7,7,7,5,7,10,5,7,7,7,7,10,7,7,7,7,5]
[12,null,0,{"$f":"C113","v":0},0,0,0,0,0,{"$f":"$V$33-IF(AND(OR(J$95=2,J$95=4,J$95=6),OR(J$96=2,J$96=4,J$96=6)),$Y$33,0)-IF(J$96=6,$W$33,0)+IF(J$99,$X$33,0)","v":16},{"$f":"$V$33-IF(AND(OR(K$95=2,K$95=4,K$95=6),OR(K$96=2,K$96=4,K$96=6)),$Y$33,0)-IF(K$96=6,$W$33,0)+IF(K$99,$X$33,0)","v":16},16,16,13,16,16,12,10,12,7,12,16,12,12,12,9,12,16,10,12,12,7,12,16,12,12,12,9,12,16,10,12,10,12,12,16,12,12,12,12,9]
[13,null,0,0,0,0,0,0,0,{"$f":"$V$43-IF(AND(OR(J$95=2,J$95=4,J$95=6),OR(J$96=2,J$96=4,J$96=6)),$Y$43,0)-IF(J$96=6,$W$43,0)+IF(J$99,$X$43,0)","v":15},{"$f":"$V$43-IF(AND(OR(K$95=2,K$95=4,K$95=6),OR(K$96=2,K$96=4,K$96=6)),$Y$43,0)-IF(K$96=6,$W$43,0)+IF(K$99,$X$43,0)","v":15},15,15,12,15,15,10,8,10,5,10,15,10,10,10,7,10,15,8,10,10,5,10,15,10,10,10,7,10,15,8,10,8,10,10,15,10,10,10,10,7]
["fpAnl",null,0,{"$f":"C115","v":0},0,0,0,0,0,1,1,1,1,1,1,1,1,1,1,{"$f":"S115","v":1},1,1,1,1,1,1,1,1,1,1,1,1,1,1,1,1,1,1,1,1,1,1,1,1,1,1,1,1,1,1,1]
["FörUnt",null,0,{"$f":"C116","v":0},0,0,0,0,0,0,0,0,0,0,0,0,0,0,0,0,0,0,0,0,0,0,0,0,0,0,0,0,0,0,0,0,0,0,0,0,0,0,0,0,0,0,0,0,0,0,0]
["Summe"]
[{"$f":"$A$100:$A$104","v":11},null,{"$f":"SUM(C100,C106,C112)","v":16},16,16,16,16,14,16,26,26,26,26,24,26,26,23,23,23,19,23,26,23,23,23,21,23,26,23,23,23,21,23,26,23,23,23,21,23,24,19,21,21,21,21,26,23,23,23,23,21]
[12,null,26,26,26,26,26,23,26,42,42,42,42,39,42,42,38,36,38,33,38,42,38,38,38,35,38,42,36,38,38,33,38,42,38,38,38,35,38,39,33,35,33,35,35,42,38,38,38,38,35]
[13,null,27,27,27,27,27,24,27,42,42,42,42,39,42,42,37,35,37,32,37,42,37,37,37,34,37,42,35,37,37,32,37,42,37,37,37,34,37,39,32,34,32,34,34,42,37,37,37,37,34]
["fpAnl",null,1,1,1,1,1,1,1,2,2,2,2,2,2,2,2,2,2,2,2,2,2,2,2,2,2,2,2,2,2,2,2,2,2,2,2,2,2,2,2,2,2,2,2,2,2,2,2,2,2]
["FörUnt",null,1,1,1,1,1,1,1,1,1,1,1,1,1,1,1,1,1,1,1,1,1,1,1,1,1,1,1,1,1,1,1,1,1,1,1,1,1,1,1,1,1,1,1,1,1,1,1,1,1]
[]
["BOS"]
["gemeinsam",null,"T","W","S","G","A","IW","GP"]
[12,null,{"$f":"$AL$23","v":18},{"$f":"C126","v":18},{"$f":"D126","v":18},18,18,18,18,{"$f":"$AL$23-IF(J$99,$AO$23,0)+IF(AND(OR(J$95=2,J$95=4,J$95=6),OR(J$96=2,J$96=4,J$96=6)),$AP$23,0)","v":13},{"$f":"$AL$23-IF(K$99,$AO$23,0)+IF(AND(OR(K$95=2,K$95=4,K$95=6),OR(K$96=2,K$96=4,K$96=6)),$AP$23,0)","v":13},13,13,13,13,13,18,20,18,20,18,13,18,18,18,18,18,13,20,18,18,20,18,13,18,18,18,18,18,13,20,18,20,18,18,13,18,18,18,18,18]
["12_1",null,{"$f":"C126/2","v":9},9,9,9,9,9,9,{"$f":"J126/2","v":6.5},{"$f":"K126/2","v":6.5},6.5,6.5,6.5,6.5,6.5,9,10,9,10,9,6.5,9,9,9,9,9,6.5,10,9,9,10,9,6.5,9,9,9,9,9,6.5,10,9,10,9,9,6.5,9,9,9,9,9]
["12_2",null,{"$f":"C127","v":9},9,9,9,9,9,9,{"$f":"J127","v":6.5},{"$f":"K127","v":6.5},6.5,6.5,6.5,6.5,6.5,9,10,9,10,9,6.5,9,9,9,9,9,6.5,10,9,9,10,9,6.5,9,9,9,9,9,6.5,10,9,10,9,9,6.5,9,9,9,9,9]
[13,null,{"$f":"$AL$53","v":17},{"$f":"C129","v":17},{"$f":"D129","v":17},17,17,17,17,{"$f":"$AL$53-IF(J$99,$AO$53,0)+IF(AND(OR(J$95=2,J$95=4,J$95=6),OR(J$96=2,J$96=4,J$96=6)),$AP$53,0)","v":12},{"$f":"$AL$53-IF(K$99,$AO$53,0)+IF(AND(OR(K$95=2,K$95=4,K$95=6),OR(K$96=2,K$96=4,K$96=6)),$AP$53,0)","v":12},12,12,12,12,12,17,19,17,19,17,12,17,17,17,17,17,12,19,17,17,19,17,12,17,17,17,17,17,12,19,17,19,17,17,12,17,17,17,17,17]
["FörUnt",null,2,{"$f":"C130","v":2},2,2,2,2,2,2,2,2,2,2,2,2,2,2,2,2,{"$f":"T130","v":2},2,2,2,2,2,2,2,2,2,2,2,2,2,2,2,2,2,2,2,2,2,2,2,2,2,2,2,2,2,2]
["Profil 1"]
[12,null,{"$f":"$AM$23-IF(C$98=\"IW\",$AN$23,0)","v":13},{"$f":"$AM$23-IF(D$98=\"IW\",$AN$23,0)","v":13},13,13,13,10,13,{"$f":"$AM$23-IF(AND(OR(J$95=2,J$95=4,J$95=6),OR(J$96=2,J$96=4,J$96=6)),$AP$23,0)-IF(J$95=6,$AN$23,0)+IF(J$99,$AO$23,0)","v":18},{"$f":"$AM$23-IF(AND(OR(K$95=2,K$95=4,K$95=6),OR(K$96=2,K$96=4,K$96=6)),$AP$23,0)-IF(K$95=6,$AN$23,0)+IF(K$99,$AO$23,0)","v":18},18,18,18,18,18,13,11,13,11,13,18,13,13,13,13,13,18,11,13,13,11,13,18,13,13,13,13,13,15,8,10,8,10,10,18,13,13,13,13,13]
["12_1",null,{"$f":"C132/2","v":6.5},6.5,6.5,6.5,6.5,5,6.5,{"$f":"J132/2","v":9},{"$f":"K132/2","v":9},9,9,9,9,9,6.5,5.5,6.5,5.5,6.5,9,6.5,6.5,6.5,6.5,6.5,9,5.5,6.5,6.5,5.5,6.5,9,6.5,6.5,6.5,6.5,6.5,7.5,4,5,4,5,5,9,6.5,6.5,6.5,6.5,6.5]
["12_2",null,{"$f":"C133","v":6.5},6.5,6.5,6.5,6.5,5,6.5,{"$f":"J133","v":9},{"$f":"K133","v":9},9,9,9,9,9,6.5,5.5,6.5,5.5,6.5,9,6.5,6.5,6.5,6.5,6.5,9,5.5,6.5,6.5,5.5,6.5,9,6.5,6.5,6.5,6.5,6.5,7.5,4,5,4,5,5,9,6.5,6.5,6.5,6.5,6.5]
[13,null,{"$f":"$AM$53-IF(C$98=\"IW\",$AN$53,0)","v":10},{"$f":"$AM$53-IF(D$98=\"IW\",$AN$53,0)","v":10},10,10,10,7,10,{"$f":"$AM$53-IF(AND(OR(J$95=2,J$95=4,J$95=6),OR(J$96=2,J$96=4,J$96=6)),$AP$53,0)-IF(J$95=6,$AN$53,0)+IF(J$99,$AO$53,0)","v":15},{"$f":"$AM$53-IF(AND(OR(K$95=2,K$95=4,K$95=6),OR(K$96=2,K$96=4,K$96=6)),$AP$53,0)-IF(K$95=6,$AN$53,0)+IF(K$99,$AO$53,0)","v":15},15,15,15,15,15,10,8,10,8,10,15,10,10,10,10,10,15,8,10,10,8,10,15,10,10,10,10,10,12,5,7,5,7,7,15,10,10,10,10,10]
["FörUnt",null,0,{"$f":"C136","v":0},{"$f":"D136","v":0},0,0,0,0,0,0,0,0,0,0,0,0,0,0,0,0,0,0,0,0,0,0,0,0,0,0,0,0,0,0,0,0,0,0,0,0,0,0,0,0,0,0,0,0,0,0]
["Profil 2"]
[12,null,null,null,null,null,null,null,null,{"$f":"$AM$23-IF(AND(OR(J$95=2,J$95=4,J$95=6),OR(J$96=2,J$96=4,J$96=6)),$AP$23,0)-IF(J$96=6,$AN$23,0)+IF(J$99,$AO$23,0)","v":18},{"$f":"$AM$23-IF(AND(OR(K$95=2,K$95=4,K$95=6),OR(K$96=2,K$96=4,K$96=6)),$AP$23,0)-IF(K$96=6,$AN$23,0)+IF(K$99,$AO$23,0)","v":18},18,18,15,18,18,13,11,13,8,13,18,13,13,13,10,13,18,11,13,13,8,13,18,13,13,13,10,13,18,11,13,11,13,13,18,13,13,13,13,10]
["12_1",null,{"$f":"C138/2","v":0},0,0,0,0,0,0,{"$f":"J138/2","v":9},{"$f":"K138/2","v":9},9,9,7.5,9,9,6.5,5.5,6.5,4,6.5,9,6.5,6.5,6.5,5,6.5,9,5.5,6.5,6.5,4,6.5,9,6.5,6.5,6.5,5,6.5,9,5.5,6.5,5.5,6.5,6.5,9,6.5,6.5,6.5,6.5,5]
["12_2",null,{"$f":"C139","v":0},0,0,0,0,0,0,{"$f":"J139","v":9},{"$f":"K139","v":9},9,9,7.5,9,9,6.5,5.5,6.5,4,6.5,9,6.5,6.5,6.5,5,6.5,9,5.5,6.5,6.5,4,6.5,9,6.5,6.5,6.5,5,6.5,9,5.5,6.5,5.5,6.5,6.5,9,6.5,6.5,6.5,6.5,5]
[13,null,0,0,0,0,0,0,0,{"$f":"$AM$53-IF(AND(OR(J$95=2,J$95=4,J$95=6),OR(J$96=2,J$96=4,J$96=6)),$AP$53,0)-IF(J$96=6,$AN$53,0)+IF(J$99,$AO$53,0)","v":15},{"$f":"$AM$53-IF(AND(OR(K$95=2,K$95=4,K$95=6),OR(K$96=2,K$96=4,K$96=6)),$AP$53,0)-IF(K$96=6,$AN$53,0)+IF(K$99,$AO$53,0)","v":15},15,15,12,15,15,10,8,10,5,10,15,10,10,10,7,10,15,8,10,10,5,10,15,10,10,10,7,10,15,8,10,8,10,10,15,10,10,10,10,7]
["FörUnt",null,0,{"$f":"C142","v":0},{"$f":"D142","v":0},0,0,0,0,0,0,0,0,0,0,0,0,0,0,0,0,0,0,0,0,0,0,0,0,0,0,0,0,0,0,0,0,0,0,0,0,0,0,0,0,0,0,0,0,0,0]
["Summe"]
[12,null,{"$f":"SUM(C126,C132,C138)","v":31},31,31,31,31,28,31,49,49,49,49,46,49,49,44,42,44,39,44,49,44,44,44,41,44,49,42,44,44,39,44,49,44,44,44,41,44,46,39,41,39,41,41,49,44,44,44,44,41]
["12_1",null,15.5,15.5,15.5,15.5,15.5,14,15.5,24.5,24.5,24.5,24.5,23,24.5,24.5,22,21,22,19.5,22,24.5,22,22,22,20.5,22,24.5,21,22,22,19.5,22,24.5,22,22,22,20.5,22,23,19.5,20.5,19.5,20.5,20.5,24.5,22,22,22,22,20.5]
["12_2",null,15.5,15.5,15.5,15.5,15.5,14,15.5,24.5,24.5,24.5,24.5,23,24.5,24.5,22,21,22,19.5,22,24.5,22,22,22,20.5,22,24.5,21,22,22,19.5,22,24.5,22,22,22,20.5,22,23,19.5,20.5,19.5,20.5,20.5,24.5,22,22,22,22,20.5]
[13,null,27,27,27,27,27,24,27,42,42,42,42,39,42,42,37,35,37,32,37,42,37,37,37,34,37,42,35,37,37,32,37,42,37,37,37,34,37,39,32,34,32,34,34,42,37,37,37,37,34]
["FörUnt",null,2,2,2,2,2,2,2,2,2,2,2,2,2,2,2,2,2,2,2,2,2,2,2,2,2,2,2,2,2,2,2,2,2,2,2,2,2,2,2,2,2,2,2,2,2,2,2,2,2]

{"sheet":"Schuldatei","index":8,"n_rows":132,"n_cols":42,"rows_kept":132,"cut":false,"hidden":true,"merged":[]}
["Schuljahr 2017/18",null,null,null,null,null,null,null,null,null,null,null,null,null,null,null,null,null,null,null,null,null,null,null,null,null,null,null,null,null,null,"FOS/BOS Ansbach (0853/0803) und FOS/BOS Triesdorf (0895/0796) in SD als \"4er-Bündel\" unter FFS=0853",null,null,null,null,null,null,null,null,{"$f":"\"Test\"&CHAR(10)&\"Test\"","v":"Test\nTest"}]
["Berufsoberschule",null,null,null,null,null,null,null,null,null,null,"Fachoberschule",null,null,null,null,null,null,null,null,null,null,"vereinigte Liste",null,null,null,null,"Liste der Planungseinheiten (SD)",null,null,null,"Liste der Planungseinheiten",null,null,null,"ohne GER in VUÜ",null,"dafür Trennung IN/EI und Trennung AN/TRI"]
[{"$f":"COUNTA(A5:A77)","v":61},null,null,null,null,null,null,null,null,null,null,{"$f":"COUNTA(L5:L77)","v":67},null,null,null,null,null,null,null,null,null,null,{"$f":"COUNTA(W5:W277)","v":128},null,null,null,null,{"$f":"COUNTA(AB5:AB277)","v":69},null,null,null,{"$f":"COUNTA(AF5:AF277)","v":70},"+1 wg. TRD/ANS","IN/EI aber zusammen!",{"$f":"SUM(AI5:AI113)","v":67},{"$f":"SUM(AJ5:AJ113)","v":61}]
["Schulnummer","Schule","Strasse","Stadt","Träger_Eder","Schulart12","Inaktiv","ERR","FFS","SNR*",null,"Schulnummer","Schule","Strasse","Stadt","Träger_Eder","Schulart12","Inaktiv","ERR","FFS","SNR*",null,"Schulnummer","FFS","SNR*","Schulart",null,"SNR*","FOS","BOS","Typ","SNR*","Kürzel",null,"FOS","BOS","FOS",null,"BOS"]
["0845","Staatliche Berufsoberschule Augsburg ","Alter Postweg 86 a","86159 Augsburg","1-staatlich","51","0","199708","0855",{"$f":"IF(I5=\" \",A5,I5)","v":"0855"},null,"0851","Staatl. Fachoberschule Altötting ","Neuöttinger Str. 64 c","84503 Altötting","1-staatlich","52","0"," "," ",{"$f":"IF(T5=\" \",L5,T5)","v":"0851"},null,"0828","0865","0865",{"$f":"IF(COUNTIF($A$5:$A$113,W5)=1,\"BOS\",\"FOS\")","v":"BOS"},null,"0837",0,1,{"$f":"IF(AI5&AJ5=\"10\",\"FOS\",IF(AI5&AJ5=\"01\",\"BOS\",\"FOBOS\"))","v":"BOS"},"0837","N-BOS","Nürnberg-BOS",{"$f":"SUMPRODUCT(($Y$5:$Y$149=$AF5)*($Z$5:$Z$149=\"FOS\"))","v":0},{"$f":"SUMPRODUCT(($Y$5:$Y$149=$AF5)*($Z$5:$Z$149=\"BOS\"))","v":1},{"$f":"IF(AI5=0,\"-\",INDEX($L$5:$L$100,MATCH($AF5,$U$5:$U$100,0)))","v":"-"},{"$f":"IF(AI5=0,\"-\",INDEX($M$5:$M$100,MATCH($AF5,$U$5:$U$100,0)))","v":"-"},{"$f":"IF(AJ5=0,\"-\",INDEX($A$5:$A$100,MATCH($AF5,$J$5:$J$100,0)))","v":"0837"},{"$f":"IF(AJ5=0,\"-\",INDEX($B$5:$B$100,MATCH($AF5,$J$5:$J$100,0)))","v":"Staatliche Berufsoberschule Nürnberg "},{"$f":"IF(AE5=\"FOS\",AL5&\"\n\"&VLOOKUP(AK5,$L$4:$O$100,3,FALSE)&\"\n\"&VLOOKUP(AK5,$L$4:$O$100,4,FALSE),IF(AE5=\"BOS\",AN5&\"\n\"&VLOOKUP(AM5,$A$4:$O$100,3,FALSE)&\"\n\"&VLOOKUP(AM5,$A$4:$O$100,4,FALSE),SUBSTITUTE(AL5,\"Fachoberschule\",\"Fachoberschule und Berufsoberschule\")&\"\n\"&VLOOKUP(AK5,$L$4:$O$100,3,FALSE)&\"\n\"&VLOOKUP(AK5,$L$4:$O$100,4,FALSE)))","v":"Staatliche Berufsoberschule Nürnberg \nSchoppershofstr. 80\n90489 Nürnberg"}]
["0846","Gustav-von-Schlör-Schule Staatliche Berufsoberschule Weiden i.d.OPf.","Campusallee 2","92637 Weiden i.d.OPf.","1-staatlich","51","0","199708","0896",{"$f":"IF(I6=\" \",A6,I6)","v":"0896"},null,"0852","Staatliche Fachoberschule Amberg ","Raigeringer Str. 27 a","92224 Amberg","1-staatlich","52","0"," ","Z312",{"$f":"IF(T6=\" \",L6,T6)","v":"Z312"},null,"0829","0867","0867",{"$f":"IF(COUNTIF($A$5:$A$113,W6)=1,\"BOS\",\"FOS\")","v":"BOS"},null,"0851",1,1,{"$f":"IF(AI6&AJ6=\"10\",\"FOS\",IF(AI6&AJ6=\"01\",\"BOS\",\"FOBOS\"))","v":"FOBOS"},"0851","AÖ","Altötting",{"$f":"SUMPRODUCT(($Y$5:$Y$149=$AF6)*($Z$5:$Z$149=\"FOS\"))","v":1},{"$f":"SUMPRODUCT(($Y$5:$Y$149=$AF6)*($Z$5:$Z$149=\"BOS\"))","v":1},{"$f":"IF(AI6=0,\"-\",INDEX($L$5:$L$100,MATCH($AF6,$U$5:$U$100,0)))","v":"0851"},{"$f":"IF(AI6=0,\"-\",INDEX($M$5:$M$100,MATCH($AF6,$U$5:$U$100,0)))","v":"Staatl. Fachoberschule Altötting "},{"$f":"IF(AJ6=0,\"-\",INDEX($A$5:$A$100,MATCH($AF6,$J$5:$J$100,0)))","v":"0839"},{"$f":"IF(AJ6=0,\"-\",INDEX($B$5:$B$100,MATCH($AF6,$J$5:$J$100,0)))","v":"Staatliche Berufsoberschule Altötting "},{"$f":"IF(AE6=\"FOS\",AL6&\"\n\"&VLOOKUP(AK6,$L$4:$O$100,3,FALSE)&\"\n\"&VLOOKUP(AK6,$L$4:$O$100,4,FALSE),IF(AE6=\"BOS\",AN6&\"\n\"&VLOOKUP(AM6,$A$4:$O$100,3,FALSE)&\"\n\"&VLOOKUP(AM6,$A$4:$O$100,4,FALSE),SUBSTITUTE(AL6,\"Fachoberschule\",\"Fachoberschule und Berufsoberschule\")&\"\n\"&VLOOKUP(AK6,$L$4:$O$100,3,FALSE)&\"\n\"&VLOOKUP(AK6,$L$4:$O$100,4,FALSE)))","v":"Staatl. Fachoberschule und Berufsoberschule Altötting \nNeuöttinger Str. 64 c\n84503 Altötting"},"Staatliche Fachoberschule und Berufsoberschule Altötting\nNeuöttinger Straße 64 c\n84503 Altötting "]
["0847","Staatliche Berufsoberschule Weilheim i.OB ","Kerschensteinerstr. 2","82362 Weilheim i.OB","1-staatlich","51","0","199708","0897","0897",null,"0853","Staatliche Fachoberschule Ansbach ","Pfarrstr. 21/23","91522 Ansbach","1-staatlich","52","0"," "," ",{"$f":"IF(T7=\" \",L7,T7)&\"A\"","v":"0853A"},null,"0830","Z424","Z424","BOS",null,"0853",2,2,"FOBOS","0853A","AN","Ansbach",1,1,"0853","Staatliche Fachoberschule Ansbach ","0803","Staatliche Berufsoberschule Ansbach ","Staatliche Fachoberschule und Berufsoberschule Ansbach \nPfarrstr. 21/23\n91522 Ansbach","Staatliche Fachoberschule und Berufsoberschule Ansbach \nPfarrstraße 21/23\n91522 Ansbach"]
["0848","Staatliche Berufsoberschule Weißenburg i.Bay. ","Wildbadstr. 19","91781 Weißenburg i.Bay.","1-staatlich","51","0","199708","6091","6091",null,"0854","Staatliche Fachoberschule Aschaffenburg ","Ottostraße 1","63741 Aschaffenburg","1-staatlich","52","0"," "," ","0854",null,"0831","0901","0901","BOS",null,"0854",1,1,"FOBOS","0853T","TRI","Triesdorf",1,1,"0895","Staatliche Fachoberschule Triesdorf in Weidenbach ","0796","Staatliche Berufsoberschule Triesdorf in Weidenbach","Staatliche Fachoberschule und Berufsoberschule Triesdorf in Weidenbach \nReitbahn 7\n91746 Weidenbach","Staatliche Fachoberschule und Berufsoberschule Triesdorf\nReitbahn 7\n91746 Weidenbach "]
["0849","Staatliche Berufsoberschule Bayreuth ","Körnerstr. 6","95448 Bayreuth","1-staatlich","51","0","199708","0859","0859",null,"0855","Staatliche Fachoberschule Augsburg ","Alter Postweg 86 a","86159 Augsburg","1-staatlich","52","0"," "," ","0855",null,"0832","0882","0882","BOS",null,"0855",1,1,"FOBOS","0854","AB","Aschaffenburg",1,1,"0854","Staatliche Fachoberschule Aschaffenburg ","0804","Staatliche Berufsoberschule Aschaffenburg ","Staatliche Fachoberschule und Berufsoberschule Aschaffenburg \nOttostraße 1\n63741 Aschaffenburg","Staatliche Fachoberschule und Berufsoberschule Aschaffenburg\nOttostraße 1\n63741 Aschaffenburg "]
["0850","Adalbert-Raps-Schule Staatliche Berufsoberschule Kulmbach","Georg-Hagen-Str. 35","95326 Kulmbach","1-staatlich","51","0","199708","Z416","Z416",null,"0856","Staatliche Fachoberschule Bad Tölz ","Alter Bahnhofplatz 10","83646 Bad Tölz","1-staatlich","52","0"," "," ","0856",null,"0833","0883","0883","BOS",null,"0856",1,1,"FOBOS","0855","A","Augsburg",1,1,"0855","Staatliche Fachoberschule Augsburg ","0845","Staatliche Berufsoberschule Augsburg ","Staatliche Fachoberschule und Berufsoberschule Augsburg \nAlter Postweg 86 a\n86159 Augsburg","Staatliche Fachoberschule und Berufsoberschule Augsburg\nAlter Postweg 86 a\n86159 Augsburg "]
["0781","Staatl. Berufsoberschule Erding ","Siglfinger Str. 50","85435 Erding","1-staatlich","51","0","200308","0924","0924",null,"0857","Staatliche Fachoberschule Bad Neustadt a.d.Saale ","Otto-Hahn-Str. 36","97616 Bad Neustadt a.d.Saale","1-staatlich","52","0"," "," ","0857",null,"0834","0905","0905","BOS",null,"0857",1,1,"FOBOS","0856","TÖL","Bad Tölz",1,1,"0856","Staatliche Fachoberschule Bad Tölz ","0821","Staatliche Berufsoberschule Bad Tölz ","Staatliche Fachoberschule und Berufsoberschule Bad Tölz \nAlter Bahnhofplatz 10\n83646 Bad Tölz","Staatliche Fachoberschule und Berufsoberschule Bad Tölz\nAlter Bahnhofplatz 10\n83646 Bad Tölz"]
["0782","Staatl. Berufsoberschule Fürstenfeldbruck ","Münchner Str. 67","82256 Fürstenfeldbruck","1-staatlich","51","0","200308","0927","0927",null,"0858","Staatliche Fachoberschule Bamberg ","Ohmstr. 17","96050 Bamberg","1-staatlich","52","0"," "," ","0858",null,"0835","Z205","Z205","BOS",null,"0858",1,1,"FOBOS","0857","NES","Bad Neustadt",1,1,"0857","Staatliche Fachoberschule Bad Neustadt a.d.Saale ","0800","Staatliche Berufsoberschule Bad Neustadt a.d.Saale ","Staatliche Fachoberschule und Berufsoberschule Bad Neustadt a.d.Saale \nOtto-Hahn-Str. 36\n97616 Bad Neustadt a.d.Saale","Staatliche Fachoberschule und Berufsoberschule Bad Neustadt\nOtto-Hahn-Straße 36\n97616 Bad Neustadt "]
["0783","Therese-von-Bayern-Schule,staatl. Berufsoberschule f.Wirtschaft u.Verwaltung München","Lindwurmstr. 90","80337 München","1-staatlich","51","0","200408","1374","1374",null,"0859","Staatliche Fachoberschule Bayreuth ","Körnerstr. 6","95448 Bayreuth","1-staatlich","52","0"," "," ","0859",null,"0836","Z126","Z126","BOS",null,"0859",1,1,"FOBOS","0858","BA","Bamberg",1,1,"0858","Staatliche Fachoberschule Bamberg ","0808","Staatliche Berufsoberschule Bamberg ","Staatliche Fachoberschule und Berufsoberschule Bamberg \nOhmstr. 17\n96050 Bamberg","Staatliche Fachoberschule und Berufsoberschule Bamberg\nOhmstraße 17\n96050 Bamberg "]
["0784","Staatl. Berufsoberschule Kelheim ","Schützenstr. 30","93309 Kelheim","1-staatlich","51","0","200608","Z173","Z173",null,"0860","Staatliche Fachoberschule Cham ","Dr.-Muggenthaler-Str. 11","93413 Cham","1-staatlich","52","0"," ","Z177","Z177",null,"0837"," ","0837","BOS",null,"0862",1,1,"FOBOS","0859","BT","Bayreuth",1,1,"0859","Staatliche Fachoberschule Bayreuth ","0849","Staatliche Berufsoberschule Bayreuth ","Staatliche Fachoberschule und Berufsoberschule Bayreuth \nKörnerstr. 6\n95448 Bayreuth","Staatliche Fachoberschule und Berufsoberschule Bayreuth\nKörnerstraße 6\n95448 Bayreuth"]
["0785","Staatl. Berufsoberschule Krumbach ","Bahnhofstr. 2","86381 Krumbach (Schwaben)","1-staatlich","51","0","200208","0873","0873",null,"0861","Regiomontanus-Schule Staatliche Fachoberschule Coburg","Plattenäcker 30","96450 Coburg","1-staatlich","52","0"," ","5013","5013",null,"0838","Z106","Z106","BOS",null,"0863",1,1,"FOBOS","0862","DEG","Deggendorf",1,1,"0862","Aloys-Fischer-Schule Staatliche Fachoberschule Deggendorf","0824","Aloys-Fischer-Schule Staatliche Berufsoberschule Deggendorf","Aloys-Fischer-Schule Staatliche Fachoberschule und Berufsoberschule Deggendorf\nJahnstr. 5\n94469 Deggendorf","Aloys-Fischer-Schule Staatliche Fachoberschule und Berufsoberschule Deggendorf\nJahnstraße 5\n94469 Deggendorf "]
["0786","Staatliche Berufsoberschule Obernburg a.Main ","Dekaneistr. 5-9","63785 Obernburg a.Main","1-staatlich","51","0","200208","7058","7058",null,"0862","Aloys-Fischer-Schule Staatliche Fachoberschule Deggendorf","Jahnstr. 5","94469 Deggendorf","1-staatlich","52","0"," "," ","0862",null,"0839","0851","0851","BOS",null,"0864",1,1,"FOBOS","0863","DON","Donauwörth",1,1,"0863","Hans-Leipelt-Schule Staatliche Fachoberschule Donauwörth","0813","Hans-Leipelt-Schule Staatliche Berufsoberschule Donauwörth","Hans-Leipelt-Schule Staatliche Fachoberschule und Berufsoberschule Donauwörth\nNeudegger Allee 9\n86609 Donauwörth","Hans-Leipelt-Schule Staatliche Fachoberschule und Berufsoberschule Donauwörth\nNeudegger Allee 9\n86609 Donauwörth "]
["0787","Staatliche Berufsoberschule Pfarrkirchen ","Von-Fraunhofer-Str. 2","84347 Pfarrkirchen","1-staatlich","51","0","200208","0888","0888",null,"0863","Hans-Leipelt-Schule Staatliche Fachoberschule Donauwörth","Neudegger Allee 9","86609 Donauwörth","1-staatlich","52","0"," "," ","0863",null,"0840","0890","0890","BOS",null,"0865",1,1,"FOBOS","0864","ER","Erlangen",1,1,"0864","Staatliche Fachoberschule Erlangen ","0827","Staatliche Berufsoberschule Erlangen ","Staatliche Fachoberschule und Berufsoberschule Erlangen \nDrausnickstr. 1 c\n91052 Erlangen","Staatliche Fachoberschule und Berufsoberschule Erlangen\nDrausnickstraße 1c\n91052 Erlangen "]
["0788","Staatl. Berufsoberschule Landsberg a.Lech ","Spitalfeldstr. 11","86899 Landsberg am Lech","1-staatlich","51","0","200908","1571","1571",null,"0864","Staatliche Fachoberschule Erlangen ","Drausnickstr. 1 c","91052 Erlangen","1-staatlich","52","0"," "," ","0864",null,"0841","0871","0871","BOS",null,"0867",1,1,"FOBOS","0865","FS","Freising",1,1,"0865","Staatliche Fachoberschule Freising ","0828","Staatliche Berufsoberschule Freising ","Staatliche Fachoberschule und Berufsoberschule Freising \nWippenhauser Str. 64\n85354 Freising","Staatliche Fachoberschule und Berufsoberschule Freising\nWippenhauser Str. 64\n85354 Freising "]
["0790","Staatliche Berufsoberschule Ingolstadt ","Oberer Graben 4","85049 Ingolstadt","1-staatlich","51","0","199708","0869","0869",null,"0865","Staatliche Fachoberschule Freising ","Wippenhauser Str. 64","85354 Freising","1-staatlich","52","0"," "," ","0865",null,"0842","Z300","Z300","BOS",null,"0869",1,1,"FOBOS","0867","FÜ","Fürth",1,1,"0867","Max-Grundig-Schule Staatliche Fachoberschule Fürth ","0829","Max-Grundig-Schule Staatliche Berufsoberschule Fürth","Max-Grundig-Schule Staatliche Fachoberschule und Berufsoberschule Fürth \nAmalienstr. 1-4\n90763 Fürth","Max-Grundig-Schule Staatliche Fachoberschule und Berufsoberschule Fürth\nAmalienstraße 2-4\n90763 Fürth "]
["0791","Staatliche Berufsoberschule Landshut ","Luitpoldstr. 26","84034 Landshut","1-staatlich","51","0","199708","3032","3032",null,"0867","Max-Grundig-Schule Staatliche Fachoberschule Fürth ","Amalienstr. 1-4","90763 Fürth","1-staatlich","52","0"," "," ","0867",null,"0843","0893","0893","BOS",null,"0870",1,1,"FOBOS","0869","IN","Ingostadt",1,1,"0869","Staatliche Fachoberschule Ingolstadt ","0790","Staatliche Berufsoberschule Ingolstadt ","Staatliche Fachoberschule und Berufsoberschule Ingolstadt \nOberer Graben 4\n85049 Ingolstadt","Staatliche Fachoberschule und Berufsoberschule Ingolstadt\nOberer Graben 4\n85049 Ingolstadt "]
["0792","Staatliche Berufsoberschule für Technik München ","Orleansstr. 44","81667 München","1-staatlich","51","0","199708","0877","0877",null,"0868","Staatliche Fachoberschule Hof ","Schloßplatz 6","95028 Hof","1-staatlich","52","0"," ","Z424","Z424",null,"0844","0894","0894","BOS",null,"0871",1,1,"FOBOS","0870","KF","Kaufbeuren",1,1,"0870","Staatliche Fachoberschule Kaufbeuren ","0820","Staatliche Berufsoberschule Kaufbeuren ","Staatliche Fachoberschule und Berufsoberschule Kaufbeuren \nJosef-Fischer-Str. 5\n87600 Kaufbeuren","Staatliche Fachoberschule und Berufsoberschule Kaufbeuren\nJosef-Fischer-Straße 5\n87600 Kaufbeuren "]
["0794","Staatliche Berufsoberschule Passau ","Heiliggeistgasse 10","94032 Passau","1-staatlich","51","0","199708","0887","0887",null,"0869","Staatliche Fachoberschule Ingolstadt ","Oberer Graben 4","85049 Ingolstadt","1-staatlich","52","0"," "," ","0869",null,"0845","0855","0855","BOS",null,"0873",1,1,"FOBOS","0871","KE","Kempten",1,1,"0871","Staatliche Fachoberschule Kempten (Allgäu) ","0841","Staatliche Berufsoberschule Kempten (Allgäu) ","Staatliche Fachoberschule und Berufsoberschule Kempten (Allgäu) \nKotterner Str. 41\n87435 Kempten (Allgäu)","Staatliche Fachoberschule und Berufsoberschule Kempten\nKotterner Str. 41\n87435 Kempten "]
["0795","Staatliche Berufsoberschule Regensburg ","Fort-Skelly-Str. 31","93053 Regensburg","1-staatlich","51","0","199708","0889",{"$f":"IF(I23=\" \",A23,I23)","v":"0889"},null,"0870","Staatliche Fachoberschule Kaufbeuren ","Josef-Fischer-Str. 5","87600 Kaufbeuren","1-staatlich","52","0"," "," ","0870",null,"1133","Z105","Z105","BOS",null,"0876",1,1,"FOBOS","0873","KRU","Krumbach",1,1,"0873","Staatliche Fachoberschule Krumbach ","0785","Staatl. Berufsoberschule Krumbach ","Staatliche Fachoberschule und Berufsoberschule Krumbach \nBahnhofstr. 2\n86381 Krumbach (Schwaben)","Staatliche Fachoberschule und Berufsoberschule Krumbach\nBahnhofstr. 2\n86381 Krumbach"]
["0796","Staatliche Berufsoberschule Triesdorf in Weidenbach","Reitbahn 7","91746 Weidenbach","1-staatlich","51","0","199708","0853",{"$f":"IF(I24=\" \",A24,I24)&\"T\"","v":"0853T"},null,"0871","Staatliche Fachoberschule Kempten (Allgäu) ","Kotterner Str. 41","87435 Kempten (Allgäu)","1-staatlich","52","0"," "," ","0871",null,"1134","1172","1172","BOS",null,"0877",1,1,"FOBOS","0876","MM","Memmingen",1,1,"0876","Staatl. Fachoberschule Memmingen ","0797","Staatl. Berufsoberschule Memmingen ","Staatl. Fachoberschule und Berufsoberschule Memmingen \nClaußweg 10\n87700 Memmingen","Staatliche Fachoberschule und Berufsoberschule Memmingen\nClaußweg 10\n87700 Memmingen"]
["0797","Staatl. Berufsoberschule Memmingen ","Claußweg 10","87700 Memmingen","1-staatlich","51","0","199708","0876","0876",null,"0872","Staatl. Fachoberschule Kitzingen ","Thomas-Ehemann-Str. 13 a","97318 Kitzingen","1-staatlich","52","0"," ","Z604","Z604",null,"1136","1173","1173","BOS",null,"0882",1,1,"FOBOS","0877","M-T","München-T",1,1,"0877","Staatliche Fachoberschule für Technik München ","0792","Staatliche Berufsoberschule für Technik München ","Staatliche Fachoberschule und Berufsoberschule für Technik München \nOrleansstr. 44\n81667 München","Staatliche Fachoberschule und Berufsoberschule München Ausbildungsrichtung Technik\nOrleansstr. 44\n81667 München "]
["0798","Staatliche Berufsoberschule Wasserburg a.Inn ","Klosterweg 21","83512 Wasserburg a.Inn","1-staatlich","51","0","199808","0907","0907",null,"0873","Staatliche Fachoberschule Krumbach ","Bahnhofstr. 2","86381 Krumbach (Schwaben)","1-staatlich","52","0"," "," ","0873",null,"0851"," ","0851","FOS",null,"0883",1,1,"FOBOS","0882","NM","Neumarkt",1,1,"0882","Maximilian-Kolbe-Schule Staatliche Fachoberschule Neumarkt i.d.OPf.","0832","Maximilian-Kolbe-Schule Staatliche Berufsoberschule Neumarkt i.d.OPf.","Maximilian-Kolbe-Schule Staatliche Fachoberschule und Berufsoberschule Neumarkt i.d.OPf.\nKerschensteinerstr. 7\n92318 Neumarkt i.d.OPf.","Maximilian-Kolbe-Schule Staatliche Fachoberschule und Berufsoberschule Neumarkt\nKerschensteiner Str. 7\n92318 Neumarkt "]
["0800","Staatliche Berufsoberschule Bad Neustadt a.d.Saale ","Otto-Hahn-Str. 36","97616 Bad Neustadt a.d.Saale","1-staatlich","51","0","199708","0857","0857",null,"0874","Staatliche Fachoberschule Landshut ","Marienplatz 11","84028 Landshut","1-staatlich","52","0"," ","Z217","Z217",null,"0852","Z312","Z312","FOS",null,"0887",1,1,"FOBOS","0883","NU","Neu-Ulm",1,1,"0883","Staatliche Fachoberschule Neu-Ulm ","0833","Staatliche Berufsoberschule Neu-Ulm ","Staatliche Fachoberschule und Berufsoberschule Neu-Ulm \nMemminger Str. 48\n89231 Neu-Ulm","Staatliche Fachoberschule und Berufsoberschule Neu-Ulm\nMemminger Str. 48\n89231 Neu-Ulm "]
["0802","Staatliche Berufsoberschule Amberg ","Raigeringer Str. 27 a","92224 Amberg","1-staatlich","51","0","199708","Z312",{"$f":"IF(I28=\" \",A28,I28)","v":"Z312"},null,"0875","Staatliche Fachoberschule Lindau (Bodensee) ","Achstr. 13","88131 Lindau (Bodensee)","1-staatlich","52","0"," ","Z795","Z795",null,"0853"," ","0853A","FOS",null,"0888",1,1,"FOBOS","0887","PA","Passau",1,1,"0887","Staatliche Fachoberschule Passau ","0794","Staatliche Berufsoberschule Passau ","Staatliche Fachoberschule und Berufsoberschule Passau \nHeiliggeistgasse 10\n94032 Passau","Staatliche Fachoberschule und Berufsoberschule Passau\nHeiliggeistgasse 10\n94032 Passau"]
["0803","Staatliche Berufsoberschule Ansbach ","Pfarrstr. 21/23","91522 Ansbach","1-staatlich","51","0","199708","0853",{"$f":"IF(I29=\" \",A29,I29)&\"A\"","v":"0853A"},null,"0876","Staatl. Fachoberschule Memmingen ","Claußweg 10","87700 Memmingen","1-staatlich","52","0"," "," ","0876",null,"0854"," ","0854","FOS",null,"0889",1,1,"FOBOS","0888","PAN","Pfarrkirchen",1,1,"0888","Staatliche Fachoberschule Pfarrkirchen ","0787","Staatliche Berufsoberschule Pfarrkirchen ","Staatliche Fachoberschule und Berufsoberschule Pfarrkirchen \nVon-Fraunhofer-Str. 2\n84347 Pfarrkirchen"]
["0804","Staatliche Berufsoberschule Aschaffenburg ","Ottostraße 1","63741 Aschaffenburg","1-staatlich","51","0","199708","0854","0854",null,"0877","Staatliche Fachoberschule für Technik München ","Orleansstr. 44","81667 München","1-staatlich","52","0","197008"," ","0877",null,"0855"," ","0855","FOS",null,"0890",1,1,"FOBOS","0889","R","Regensburg",1,1,"0889","Staatliche Fachoberschule Regensburg ","0795","Staatliche Berufsoberschule Regensburg ","Staatliche Fachoberschule und Berufsoberschule Regensburg \nFort-Skelly-Str. 31\n93053 Regensburg"]
["0807","Staatliche Berufsoberschule Lindau (Bodensee) ","Achstr. 13","88131 Lindau (Bodensee)","1-staatlich","51","0","201008","Z795","Z795",null,"0882","Maximilian-Kolbe-Schule Staatliche Fachoberschule Neumarkt i.d.OPf.","Kerschensteinerstr. 7","92318 Neumarkt i.d.OPf.","1-staatlich","52","0"," "," ","0882",null,"0856"," ","0856","FOS",null,"0893",1,1,"FOBOS","0890","RO","Rosenheim",1,1,"0890","Staatl. Fachoberschule Rosenheim ","0840","Staatliche Berufsoberschule Rosenheim ","Staatl. Fachoberschule und Berufsoberschule Rosenheim \nWesterndorfer Str. 45\n83024 Rosenheim"]
["0808","Staatliche Berufsoberschule Bamberg ","Ohmstr. 17","96050 Bamberg","1-staatlich","51","0","199708","0858","0858",null,"0883","Staatliche Fachoberschule Neu-Ulm ","Memminger Str. 48","89231 Neu-Ulm","1-staatlich","52","0"," "," ","0883",null,"0857"," ","0857","FOS",null,"0894",1,1,"FOBOS","0893","SW","Schweinfurt",1,1,"0893","Friedrich-Fischer-Schule Staatliche Fachoberschule Schweinfurt","0843","Friedrich-Fischer-Schule Staatl.Berufsoberschule Schweinfurt","Friedrich-Fischer-Schule Staatliche Fachoberschule und Berufsoberschule Schweinfurt\nGoethestr. 5\n97421 Schweinfurt"]
["0813","Hans-Leipelt-Schule Staatliche Berufsoberschule Donauwörth","Neudegger Allee 9","86609 Donauwörth","1-staatlich","51","0","199708","0863","0863",null,"0886","Staatliche Fachoberschule Obernburg a.Main ","Dekaneistr. 5-9","63785 Obernburg a.Main","1-staatlich","52","0"," ","7058","7058",null,"0858"," ","0858","FOS",null,"0896",1,1,"FOBOS","0894","TS","Traunstein",1,1,"0894","Staatliche Fachoberschule Traunstein ","0844","Staatliche Berufsoberschule Traunstein ","Staatliche Fachoberschule und Berufsoberschule Traunstein \nWasserburger Str. 48\n83278 Traunstein"]
["0814","Staatliche Berufsoberschule Regen ","Obere Bachgasse 23","94209 Regen","1-staatlich","51","0","201108","3039","3039",null,"0887","Staatliche Fachoberschule Passau ","Heiliggeistgasse 10","94032 Passau","1-staatlich","52","0"," "," ","0887",null,"0859"," ","0859","FOS",null,"0897",1,1,"FOBOS","0896","WEN","Weiden",1,1,"0896","Gustav-von-Schlör-Schule Staatliche Fachoberschule Weiden i.d.OPf.","0846","Gustav-von-Schlör-Schule Staatliche Berufsoberschule Weiden i.d.OPf.","Gustav-von-Schlör-Schule Staatliche Fachoberschule und Berufsoberschule Weiden i.d.OPf.\nCampusallee 2\n92637 Weiden i.d.OPf."]
["0815","Staatl. Berufsoberschule Marktredwitz ","Schulstr. 12","95615 Marktredwitz","1-staatlich","51","0","201108","Z423","Z423",null,"0888","Staatliche Fachoberschule Pfarrkirchen ","Von-Fraunhofer-Str. 2","84347 Pfarrkirchen","1-staatlich","52","0"," "," ","0888",null,"0860","Z177","Z177","FOS",null,"0901",1,1,"FOBOS","0897","WM","Weilheim",1,1,"0897","Staatliche Fachoberschule Weilheim i.OB ","0847","Staatliche Berufsoberschule Weilheim i.OB ","Staatliche Fachoberschule und Berufsoberschule Weilheim i.OB \nKerschensteinerstr. 2\n82362 Weilheim i.OB"]
["0816","Staatl. Berufsoberschule Friedberg ","Aichacher Str. 18","86316 Friedberg","1-staatlich","51","0","201108","0919","0919",null,"0889","Staatliche Fachoberschule Regensburg ","Fort-Skelly-Str. 31","93053 Regensburg","1-staatlich","52","0"," "," ","0889",null,"0861","5013","5013","FOS",null,"0903",1,0,"FOBOS","0901","MAR","Marktheidenfeld",1,1,"0901","Staatliche Fachoberschule Marktheidenfeld ","0831","Staatliche Berufsoberschule Marktheidenfeld ","Staatliche Fachoberschule und Berufsoberschule Marktheidenfeld \nFriedenstr. 44\n97828 Marktheidenfeld"]
["0818","Staatl. Berufsoberschule Waldkirchen ","Freyunger Str. 8","94065 Waldkirchen","1-staatlich","51","0","201108","Z204","Z204",null,"0890","Staatl. Fachoberschule Rosenheim ","Westerndorfer Str. 45","83024 Rosenheim","1-staatlich","52","0"," "," ","0890",null,"0862"," ","0862","FOS",null,"0905",1,1,"FOS","0903","N-FOS","Nürnberg-FOS",1,0,"0903","Lothar-von-Faber-Schule Staatliche Fachoberschule Nürnberg","-","-","Lothar-von-Faber-Schule Staatliche Fachoberschule Nürnberg\nSchafhofstr. 25\n90411 Nürnberg"]
["0819","Staatl. Berufsoberschule Neusäß ","Landrat-Dr.-Frey-Str. 12","86356 Neusäß","1-staatlich","51","0","201108","Z713","Z713",null,"0891","Staatliche Fachoberschule Schönbrunn in Landshut ","Am Lurzenhof 5","84036 Landshut","1-staatlich","52","0"," ","Z205","Z205",null,"0863"," ","0863","FOS",null,"0907",1,1,"FOBOS","0905","SR","Straubing",1,1,"0905","Staatl. Fachoberschule Straubing ","0834","Staatliche Berufsoberschule Straubing ","Staatl. Fachoberschule und Berufsoberschule Straubing \nStadtgraben 38\n94315 Straubing"]
["0820","Staatliche Berufsoberschule Kaufbeuren ","Josef-Fischer-Str. 5","87600 Kaufbeuren","1-staatlich","51","0","199708","0870","0870",null,"0892","Staatliche Fachoberschule Schwandorf ","Glätzlstr. 29","92421 Schwandorf","1-staatlich","52","0"," ","Z300","Z300",null,"0864"," ","0864","FOS",null,"0919",1,1,"FOBOS","0907","WS","Wasserburg",1,1,"0907","Staatliche Fachoberschule Wasserburg a.Inn ","0798","Staatliche Berufsoberschule Wasserburg a.Inn ","Staatliche Fachoberschule und Berufsoberschule Wasserburg a.Inn \nKlosterweg 21\n83512 Wasserburg a.Inn"]
["0821","Staatliche Berufsoberschule Bad Tölz ","Alter Bahnhofplatz 10","83646 Bad Tölz","1-staatlich","51","0","199708","0856","0856",null,"0893","Friedrich-Fischer-Schule Staatliche Fachoberschule Schweinfurt","Goethestr. 5","97421 Schweinfurt","1-staatlich","52","0"," "," ","0893",null,"0865"," ","0865","FOS",null,"0924",1,1,"FOBOS","0919","FRI","Friedberg",1,1,"0919","Staatl. Fachoberschule Friedberg ","0816","Staatl. Berufsoberschule Friedberg ","Staatl. Fachoberschule und Berufsoberschule Friedberg \nAichacher Str. 18\n86316 Friedberg"]
["0822","Staatliche Berufsoberschule Cham ","Dr.-Muggenthaler-Str. 11","93413 Cham","1-staatlich","51","0","199708","Z177","Z177",null,"0894","Staatliche Fachoberschule Traunstein ","Wasserburger Str. 48","83278 Traunstein","1-staatlich","52","0"," "," ","0894",null,"0867"," ","0867","FOS",null,"0927",1,1,"FOBOS","0924","ED","Erding",1,1,"0924","Staatl. Fachoberschule Erding ","0781","Staatl. Berufsoberschule Erding ","Staatl. Fachoberschule und Berufsoberschule Erding \nSiglfinger Str. 50\n85435 Erding"]
["0823","Regiomontanus-Schule Staatliche Berufsoberschule Coburg","Plattenäcker 30","96450 Coburg","1-staatlich","51","0","199708","5013","5013",null,"0895","Staatliche Fachoberschule Triesdorf in Weidenbach ","Reitbahn 7","91746 Weidenbach","1-staatlich","52","0"," ","0853",{"$f":"IF(T42=\" \",L42,T42)&\"T\"","v":"0853T"},null,"0868","Z424","Z424","FOS",null,"1170",1,0,"FOBOS","0927","FFB","Fürstenfeldbruck",1,1,"0927","Staatl. Fachoberschule Fürstenfeldbruck ","0782","Staatl. Berufsoberschule Fürstenfeldbruck ","Staatl. Fachoberschule und Berufsoberschule Fürstenfeldbruck \nMünchner Str. 67\n82256 Fürstenfeldbruck"]
["0824","Aloys-Fischer-Schule Staatliche Berufsoberschule Deggendorf","Jahnstr. 5","94469 Deggendorf","1-staatlich","51","0","199708","0862","0862",null,"0896","Gustav-von-Schlör-Schule Staatliche Fachoberschule Weiden i.d.OPf.","Campusallee 2","92637 Weiden i.d.OPf.","1-staatlich","52","0"," "," ","0896",null,"0869"," ","0869","FOS",null,"1172",1,1,"FOS","1170","HOL","Holzkirchen",1,0,"1170","Staatliche Fachoberschule Holzkirchen ","-","-","Staatliche Fachoberschule Holzkirchen \nJörg-Hube-Str. 2\n83607 Holzkirchen"]
["0826","Staatl. Berufsoberschule Kitzingen ","Thomas-Ehemann-Str. 13 a","97318 Kitzingen","1-staatlich","51","0","199908","Z604","Z604",null,"0897","Staatliche Fachoberschule Weilheim i.OB ","Kerschensteinerstr. 2","82362 Weilheim i.OB","1-staatlich","52","0"," "," ","0897",null,"0870"," ","0870","FOS",null,"1173",1,1,"FOBOS","1172","WÜR","Würzburg",1,1,"1172","Staatliche Fachoberschule Würzburg ","1134","Staatliche Berufsoberschule Würzburg ","Staatliche Fachoberschule und Berufsoberschule Würzburg \nMozartstr. 9\n97074 Würzburg"]
["0827","Staatliche Berufsoberschule Erlangen ","Drausnickstr. 1 c","91052 Erlangen","1-staatlich","51","0","199708","0864","0864",null,"0898","Staatliche Fachoberschule Weißenburg i.Bay. ","Wildbadstr. 19","91781 Weißenburg i.Bay.","1-staatlich","52","0"," ","6091","6091",null,"0871"," ","0871","FOS",null,"1188",1,0,"FOBOS","1173","USH","Unterschleißheim",1,1,"1173","Staatliche Fachoberschule Unterschleißheim ","1136","Staatliche Berufsoberschule Unterschleißheim ","Staatliche Fachoberschule und Berufsoberschule Unterschleißheim \nSüdliche Ingolstädter Str. 1\n85716 Unterschleißheim"]
["0828","Staatliche Berufsoberschule Freising ","Wippenhauser Str. 64","85354 Freising","1-staatlich","51","0","199708","0865","0865",null,"0900","Adalbert-Raps-Schule Staatl. Fachoberschule Kulmbach","Georg-Hagen-Str. 35","95326 Kulmbach","1-staatlich","52","0"," ","Z416","Z416",null,"0872","Z604","Z604","FOS",null,"1193",1,0,"FOS","1188","N-FOS II","Nürnberg-FOS II",1,0,"1188","Staatliche Fachoberschule II Nürnberg ","-","-","Staatliche Fachoberschule II Nürnberg \nRothenburger Str. 401\n90431 Nürnberg"]
["0829","Max-Grundig-Schule Staatliche Berufsoberschule Fürth","Amalienstr. 2-4","90763 Fürth","1-staatlich","51","0","199708","0867","0867",null,"0901","Staatliche Fachoberschule Marktheidenfeld ","Friedenstr. 44","97828 Marktheidenfeld","1-staatlich","52","0"," "," ","0901",null,"0873"," ","0873","FOS",null,"1374",1,1,"FOS","1193","GER","Germering",1,0,"1193","Staatl. Fachoberschule Germering ","-","-","Staatl. Fachoberschule Germering \nMasurenweg 2\n82110 Germering"]
["0830","Staatliche Berufsoberschule Hof ","Schloßplatz 6","95028 Hof","1-staatlich","51","0","199708","Z424","Z424",null,"0903","Lothar-von-Faber-Schule Staatliche Fachoberschule Nürnberg","Schafhofstr. 25","90411 Nürnberg","1-staatlich","52","0"," "," ","0903",null,"0874","Z217","Z217","FOS",null,"1571",1,1,"FOBOS","1374","M-W","München-W",1,1,"0930","Therese-von-Bayern-Schule, Staatl. Fachoberschule für Wirtschaft und Verwaltung München","0783","Therese-von-Bayern-Schule,staatl. Berufsoberschule f.Wirtschaft u.Verwaltung München","Therese-von-Bayern-Schule, Staatl. Fachoberschule und Berufsoberschule für Wirtschaft und Verwaltung München\nLindwurmstr. 90\n80337 München"]
["0831","Staatliche Berufsoberschule Marktheidenfeld ","Friedenstr. 44","97828 Marktheidenfeld","1-staatlich","51","0","199708","0901","0901",null,"0904","Staatl. Fachoberschule Sonthofen ","Albert-Schweitzer-Str. 19","87527 Sonthofen","1-staatlich","52","0"," ","Z705","Z705",null,"0875","Z795","Z795","FOS",null,"1762",1,0,"FOBOS","1571","LL","Landsberg",1,1,"0922","Staatl. Fachoberschule Landsberg a.Lech ","0788","Staatl. Berufsoberschule Landsberg a.Lech ","Staatl. Fachoberschule und Berufsoberschule Landsberg a.Lech \nSpitalfeldstr. 11\n86899 Landsberg am Lech"]
["0832","Maximilian-Kolbe-Schule Staatliche Berufsoberschule Neumarkt i.d.OPf.","Kerschensteinerstr. 7","92318 Neumarkt i.d.OPf.","1-staatlich","51","0","199708","0882","0882",null,"0905","Staatl. Fachoberschule Straubing ","Stadtgraben 38","94315 Straubing","1-staatlich","52","0"," "," ",{"$f":"IF(T50=\" \",L50,T50)","v":"0905"},null,"0876"," ","0876","FOS",null,"3032",0,1,"FOS","1762","STA","Starnberg",1,0,"1184","Staatl. Fachoberschule Starnberg ","-","-","Staatl. Fachoberschule Starnberg \nVon-der-Tann-Str. 28\n82319 Starnberg"]
["0833","Staatliche Berufsoberschule Neu-Ulm ","Memminger Str. 48","89231 Neu-Ulm","1-staatlich","51","0","199708","0883","0883",null,"0907","Staatliche Fachoberschule Wasserburg a.Inn ","Klosterweg 21","83512 Wasserburg a.Inn","1-staatlich","52","0"," "," ","0907",null,"0877"," ","0877","FOS",null,"3039",1,1,"BOS","3032","LABOS","Landshut-BOS",0,1,"-","-","0791","Staatliche Berufsoberschule Landshut ","Staatliche Berufsoberschule Landshut \nLuitpoldstr. 26\n84034 Landshut"]
["0834","Staatliche Berufsoberschule Straubing ","Stadtgraben 38","94315 Straubing","1-staatlich","51","0","199708","0905","0905",null,"0910","Staatliche Fachoberschule Regen ","Obere Bachgasse 23","94209 Regen","1-staatlich","52","0","197508","3039","3039",null,"0919"," ","0919","FOS",null,"5013",1,1,"FOBOS","3039","REG","Regen",1,1,"0910","Staatliche Fachoberschule Regen ","0814","Staatliche Berufsoberschule Regen ","Staatliche Fachoberschule und Berufsoberschule Regen \nObere Bachgasse 23\n94209 Regen"]
["0835","Staatliche Berufsoberschule Schönbrunn in Landshut ","Am Lurzenhof 5","84036 Landshut","1-staatlich","51","0"," ","Z205","Z205",null,"0919","Staatl. Fachoberschule Friedberg ","Aichacher Str. 18","86316 Friedberg","1-staatlich","52","0","200008"," ","0919",null,"0920","Z204","Z204","FOS",null,"6091",1,1,"FOBOS","5013","CO","Coburg",1,1,"0861","Regiomontanus-Schule Staatliche Fachoberschule Coburg","0823","Regiomontanus-Schule Staatliche Berufsoberschule Coburg","Regiomontanus-Schule Staatliche Fachoberschule und Berufsoberschule Coburg\nPlattenäcker 30\n96450 Coburg"]
["0836","Staatliche Berufsoberschule Miesbach ","Frauenschulstr. 1","83714 Miesbach","1-staatlich","51","0"," ","Z126","Z126",null,"0920","Staatl. Fachoberschule Waldkirchen ","Freyunger Str. 8","94065 Waldkirchen","1-staatlich","52","0","200208","Z204","Z204",null,"0921","Z105","Z105","FOS",null,"7058",1,1,"FOBOS","6091","WUG","Weißenburg",1,1,"0898","Staatliche Fachoberschule Weißenburg i.Bay. ","0848","Staatliche Berufsoberschule Weißenburg i.Bay. ","Staatliche Fachoberschule und Berufsoberschule Weißenburg i.Bay. \nWildbadstr. 19\n91781 Weißenburg i.Bay."]
["0837","Staatliche Berufsoberschule Nürnberg ","Schoppershofstr. 80","90489 Nürnberg","1-staatlich","51","0"," "," ","0837",null,"0921","Staatl. Fachoberschule Neuburg a.d.Donau ","Eybstraße 251","86633 Neuburg a.d.Donau","1-staatlich","52","0","200208","Z105","Z105",null,"0922","1571","1571","FOS",null,"Z105",1,1,"FOBOS","7058","OBB","Obernburg",1,1,"0886","Staatliche Fachoberschule Obernburg a.Main ","0786","Staatliche Berufsoberschule Obernburg a.Main ","Staatliche Fachoberschule und Berufsoberschule Obernburg a.Main \nDekaneistr. 5-9\n63785 Obernburg a.Main"]
["0838","Staatliche Berufsoberschule Scheyern ","Schyrenplatz 1","85298 Scheyern","1-staatlich","51","0","197608","Z106","Z106",null,"0922","Staatl. Fachoberschule Landsberg a.Lech ","Spitalfeldstr. 11","86899 Landsberg am Lech","1-staatlich","52","0","200208","1571","1571",null,"0923","Z403","Z403","FOS",null,"Z106",1,1,"FOBOS","Z105","ND","Neuburg",1,1,"0921","Staatl. Fachoberschule Neuburg a.d.Donau ","1133","Staatliche Berufsoberschule Neuburg a.d.Donau ","Staatl. Fachoberschule und Berufsoberschule Neuburg a.d.Donau \nEybstraße 251\n86633 Neuburg a.d.Donau"]
["0839","Staatliche Berufsoberschule Altötting ","Neuöttinger Str. 64 c","84503 Altötting","1-staatlich","51","0","199708","0851","0851",null,"0923","Staatl. Fachoberschule Forchheim ","Fritz-Hoffmann-Str. 3","91301 Forchheim","1-staatlich","52","0","200208","Z403","Z403",null,"0924"," ","0924","FOS",null,"Z126",0,1,"FOBOS","Z106","SCHEY","Scheyern",1,1,"0948","Staatliche Fachoberschule Scheyern ","0838","Staatliche Berufsoberschule Scheyern ","Staatliche Fachoberschule und Berufsoberschule Scheyern \nSchyrenplatz 1\n85298 Scheyern"]
["0840","Staatliche Berufsoberschule Rosenheim ","Westerndorfer Str. 45","83024 Rosenheim","1-staatlich","51","0","199708","0890","0890",null,"0924","Staatl. Fachoberschule Erding ","Siglfinger Str. 50","85435 Erding","1-staatlich","52","0","200308"," ","0924",null,"0927"," ","0927","FOS",null,"Z173",1,1,"BOS","Z126","MB","Miesbach",0,1,"-","-","0836","Staatliche Berufsoberschule Miesbach ","Staatliche Berufsoberschule Miesbach \nFrauenschulstr. 1\n83714 Miesbach"]
["0841","Staatliche Berufsoberschule Kempten (Allgäu) ","Kotterner Str. 41","87435 Kempten (Allgäu)","1-staatlich","51","0","199708","0871","0871",null,"0927","Staatl. Fachoberschule Fürstenfeldbruck ","Münchner Str. 67","82256 Fürstenfeldbruck","1-staatlich","52","0","200308"," ","0927",null,"0928","Z173","Z173","FOS",null,"Z177",1,1,"FOBOS","Z173","KEH","Kelheim",1,1,"0928","Staatl. Fachoberschule Kelheim ","0784","Staatl. Berufsoberschule Kelheim ","Staatl. Fachoberschule und Berufsoberschule Kelheim \nSchützenstr. 30\n93309 Kelheim"]
["0842","Staatliche Berufsoberschule Schwandorf ","Glätzlstr. 29","92421 Schwandorf","1-staatlich","51","0","199708","Z300","Z300",null,"0928","Staatl. Fachoberschule Kelheim ","Schützenstr. 30","93309 Kelheim","1-staatlich","52","0","200308","Z173","Z173",null,"0882"," ","0882","FOS",null,"Z204",1,1,"FOBOS","Z177","CHA","Cham",1,1,"0860","Staatliche Fachoberschule Cham ","0822","Staatliche Berufsoberschule Cham ","Staatliche Fachoberschule und Berufsoberschule Cham \nDr.-Muggenthaler-Str. 11\n93413 Cham"]
["0843","Friedrich-Fischer-Schule Staatl.Berufsoberschule Schweinfurt","Goethestr. 5","97421 Schweinfurt","1-staatlich","51","0","199708","0893","0893",null,"0930","Therese-von-Bayern-Schule, Staatl. Fachoberschule für Wirtschaft und Verwaltung München","Lindwurmstr. 90","80337 München","1-staatlich","52","0","200408","1374","1374",null,"0883"," ","0883","FOS",null,"Z205",1,1,"FOBOS","Z204","WDK","Waldkirchen",1,1,"0920","Staatl. Fachoberschule Waldkirchen ","0818","Staatl. Berufsoberschule Waldkirchen ","Staatl. Fachoberschule und Berufsoberschule Waldkirchen \nFreyunger Str. 8\n94065 Waldkirchen"]
["0844","Staatliche Berufsoberschule Traunstein ","Wasserburger Str. 48","83278 Traunstein","1-staatlich","51","0","199708","0894","0894",null,"0932","Staatl. Fachoberschule Neusäß ","Landrat-Dr.-Frey-Str. 12","86356 Neusäß","1-staatlich","52","0","200408","Z713","Z713",null,"0886","7058","7058","FOS",null,"Z217",1,0,"FOBOS","Z205","LASCHÖ","Landshut-Schönbrunn",1,1,"0891","Staatliche Fachoberschule Schönbrunn in Landshut ","0835","Staatliche Berufsoberschule Schönbrunn in Landshut ","Staatliche Fachoberschule und Berufsoberschule Schönbrunn in Landshut \nAm Lurzenhof 5\n84036 Landshut"]
["1133","Staatliche Berufsoberschule Neuburg a.d.Donau ","Eybstraße  251","86633 Neuburg a.d.Donau","1-staatlich","51","0","201208","Z105","Z105",null,"0942","Staatl. Fachoberschule Marktredwitz ","Schulstr. 12","95615 Marktredwitz","1-staatlich","52","0","200808","Z423","Z423",null,"0887"," ","0887","FOS",null,"Z300",1,1,"FOS","Z217","LAFOS","Landshut-FOS",1,0,"0874","Staatliche Fachoberschule Landshut ","-","-","Staatliche Fachoberschule Landshut \nMarienplatz 11\n84028 Landshut"]
["1134","Staatliche Berufsoberschule Würzburg ","Mozartstr. 9","97074 Würzburg","1-staatlich","51","0","201308","1172","1172",null,"0948","Staatliche Fachoberschule Scheyern ","Schyrenplatz 1","85298 Scheyern","1-staatlich","52","0","201208","Z106","Z106",null,"0888"," ","0888","FOS",null,"Z312",1,1,"FOBOS","Z300","SAD","Schwandorf",1,1,"0892","Staatliche Fachoberschule Schwandorf ","0842","Staatliche Berufsoberschule Schwandorf ","Staatliche Fachoberschule und Berufsoberschule Schwandorf \nGlätzlstr. 29\n92421 Schwandorf"]
["1136","Staatliche Berufsoberschule Unterschleißheim ","Südliche Ingolstädter Str. 1","85716 Unterschleißheim","1-staatlich","51","0","201408","1173","1173",null,"1170","Staatliche Fachoberschule Holzkirchen ","Jörg-Hube-Str. 2","83607 Holzkirchen","1-staatlich","52","0","201208"," ","1170",null,"0889"," ","0889","FOS",null,"Z403",1,0,"FOBOS","Z312","AM","Amberg",1,1,"0852","Staatliche Fachoberschule Amberg ","0802","Staatliche Berufsoberschule Amberg ","Staatliche Fachoberschule und Berufsoberschule Amberg \nRaigeringer Str. 27 a\n92224 Amberg"]
[null,null,null,null,null,null,null,null,null,null,null,"1172","Staatliche Fachoberschule Würzburg ","Mozartstr. 9","97074 Würzburg","1-staatlich","52","0","201308"," ","1172",null,"0890"," ","0890","FOS",null,"Z416",1,1,"FOS","Z403","FO","Forchheim",1,0,"0923","Staatl. Fachoberschule Forchheim ","-","-","Staatl. Fachoberschule Forchheim \nFritz-Hoffmann-Str. 3\n91301 Forchheim"]
[null,null,null,null,null,null,null,null,null,null,null,"1173","Staatliche Fachoberschule Unterschleißheim ","Südliche Ingolstädter Str. 1","85716 Unterschleißheim","1-staatlich","52","0","201308"," ","1173",null,"0891","Z205","Z205","FOS",null,"Z423",1,1,"FOBOS","Z416","KU","Kulmbach",1,1,"0900","Adalbert-Raps-Schule Staatl. Fachoberschule Kulmbach","0850","Adalbert-Raps-Schule Staatliche Berufsoberschule Kulmbach","Adalbert-Raps-Schule Staatl. Fachoberschule und Berufsoberschule Kulmbach\nGeorg-Hagen-Str. 35\n95326 Kulmbach"]
[null,null,null,null,null,null,null,null,null,null,null,"1175","Staatliche Fachoberschule Lauf a.d.Pegnitz ","Rudolfshofer Str. 30","91207 Lauf a.d.Pegnitz","1-staatlich","52","0","201308","Z521","Z521",null,"0892","Z300","Z300","FOS",null,"Z424",1,1,"FOBOS","Z423","MKR","Marktredwitz",1,1,"0942","Staatl. Fachoberschule Marktredwitz ","0815","Staatl. Berufsoberschule Marktredwitz ","Staatl. Fachoberschule und Berufsoberschule Marktredwitz \nSchulstr. 12\n95615 Marktredwitz"]
[null,null,null,null,null,null,null,null,null,null,null,"1184","Staatl. Fachoberschule Starnberg ","Von-der-Tann-Str. 28","82319 Starnberg","1-staatlich","52","0","201508","1762","1762",null,"0893"," ","0893","FOS",null,"Z521",1,0,"FOBOS","Z424","HO","Hof",1,1,"0868","Staatliche Fachoberschule Hof ","0830","Staatliche Berufsoberschule Hof ","Staatliche Fachoberschule und Berufsoberschule Hof \nSchloßplatz 6\n95028 Hof"]
[null,null,null,null,null,null,null,null,null,null,null,"1188","Staatliche Fachoberschule II Nürnberg ","Rothenburger Str. 401","90431 Nürnberg","1-staatlich","52","0","201608"," ",{"$f":"IF(T70=\" \",L70,T70)","v":"1188"},null,"0894"," ","0894",{"$f":"IF(COUNTIF($A$5:$A$113,W70)=1,\"BOS\",\"FOS\")","v":"FOS"},null,"Z604",1,1,{"$f":"IF(AI70&AJ70=\"10\",\"FOS\",IF(AI70&AJ70=\"01\",\"BOS\",\"FOBOS\"))","v":"FOS"},"Z521","LAUF","Lauf",{"$f":"SUMPRODUCT(($Y$5:$Y$149=$AF70)*($Z$5:$Z$149=\"FOS\"))","v":1},{"$f":"SUMPRODUCT(($Y$5:$Y$149=$AF70)*($Z$5:$Z$149=\"BOS\"))","v":0},{"$f":"IF(AI70=0,\"-\",INDEX($L$5:$L$100,MATCH($AF70,$U$5:$U$100,0)))","v":"1175"},{"$f":"IF(AI70=0,\"-\",INDEX($M$5:$M$100,MATCH($AF70,$U$5:$U$100,0)))","v":"Staatliche Fachoberschule Lauf a.d.Pegnitz "},{"$f":"IF(AJ70=0,\"-\",INDEX($A$5:$A$100,MATCH($AF70,$J$5:$J$100,0)))","v":"-"},{"$f":"IF(AJ70=0,\"-\",INDEX($B$5:$B$100,MATCH($AF70,$J$5:$J$100,0)))","v":"-"},{"$f":"IF(AE70=\"FOS\",AL70&\"\n\"&VLOOKUP(AK70,$L$4:$O$100,3,FALSE)&\"\n\"&VLOOKUP(AK70,$L$4:$O$100,4,FALSE),IF(AE70=\"BOS\",AN70&\"\n\"&VLOOKUP(AM70,$A$4:$O$100,3,FALSE)&\"\n\"&VLOOKUP(AM70,$A$4:$O$100,4,FALSE),SUBSTITUTE(AL70,\"Fachoberschule\",\"Fachoberschule und Berufsoberschule\")&\"\n\"&VLOOKUP(AK70,$L$4:$O$100,3,FALSE)&\"\n\"&VLOOKUP(AK70,$L$4:$O$100,4,FALSE)))","v":"Staatliche Fachoberschule Lauf a.d.Pegnitz \nRudolfshofer Str. 30\n91207 Lauf a.d.Pegnitz"}]
[null,null,null,null,null,null,null,null,null,null,null,"1193","Staatl. Fachoberschule Germering ","Masurenweg 2","82110 Germering","1-staatlich","52","0","201708"," ","1193",null,"0895","0853","0853T","FOS",null,"Z705",1,0,"FOBOS","Z604","KT","Kitzingen",1,1,"0872","Staatl. Fachoberschule Kitzingen ","0826","Staatl. Berufsoberschule Kitzingen ","Staatl. Fachoberschule und Berufsoberschule Kitzingen \nThomas-Ehemann-Str. 13 a\n97318 Kitzingen"]
[null,null,null,null,null,null,null,null,null,null,null,null,null,null,null,null,null,null,null,null,null,null,"0896"," ","0896","FOS",null,"Z713",1,1,"FOS","Z705","SF","Sonthofen",1,0,"0904","Staatl. Fachoberschule Sonthofen ","-","-","Staatl. Fachoberschule Sonthofen \nAlbert-Schweitzer-Str. 19\n87527 Sonthofen"]
[null,null,null,null,null,null,null,null,null,null,null,null,null,null,null,null,null,null,null,null,null,null,"0897"," ","0897","FOS",null,"Z795",1,1,"FOBOS","Z713","Neus","Neusäß",1,1,"0932","Staatl. Fachoberschule Neusäß ","0819","Staatl. Berufsoberschule Neusäß ","Staatl. Fachoberschule und Berufsoberschule Neusäß \nLandrat-Dr.-Frey-Str. 12\n86356 Neusäß"]
[null,null,null,null,null,null,null,null,null,null,null,null,null,null,null,null,null,null,null,null,null,null,"0898","6091","6091","FOS",null,null,null,null,"FOBOS","Z795","LI","Lindau",1,1,"0875","Staatliche Fachoberschule Lindau (Bodensee) ","0807","Staatliche Berufsoberschule Lindau (Bodensee) ","Staatliche Fachoberschule und Berufsoberschule Lindau (Bodensee) \nAchstr. 13\n88131 Lindau (Bodensee)"]
[null,null,null,null,null,null,null,null,null,null,null,null,null,null,null,null,null,null,null,null,null,null,"0900","Z416","Z416","FOS",null,null,null,null,"FOBOS",null,"EI","Eichstätt",null,null,null,"-"]
[null,null,null,null,null,null,null,null,null,null,null,null,null,null,null,null,null,null,null,null,null,null,"0901"," ","0901","FOS"]
[null,null,null,null,null,null,null,null,null,null,null,null,null,null,null,null,null,null,null,null,null,null,"0903"," ","0903","FOS"]
[null,null,null,null,null,null,null,null,null,null,null,null,null,null,null,null,null,null,null,null,null,null,"0904","Z705","Z705","FOS"]
[null,null,null,null,null,null,null,null,null,null,null,null,null,null,null,null,null,null,null,null,null,null,"0905"," ","0905","FOS"]
[null,null,null,null,null,null,null,null,null,null,null,null,null,null,null,null,null,null,null,null,null,null,"0907"," ","0907","FOS"]
[null,null,null,null,null,null,null,null,null,null,null,null,null,null,null,null,null,null,null,null,null,null,"0910","3039","3039","FOS"]
[null,null,null,null,null,null,null,null,null,null,null,null,null,null,null,null,null,null,null,null,null,null,"0930","1374","1374","FOS"]
[null,null,null,null,null,null,null,null,null,null,null,null,null,null,null,null,null,null,null,null,null,null,"0932","Z713","Z713","FOS"]
[null,null,null,null,null,null,null,null,null,null,null,null,null,null,null,null,null,null,null,null,null,null,"0942","Z423","Z423","FOS"]
[null,null,null,null,null,null,null,null,null,null,null,null,null,null,null,null,null,null,null,null,null,null,"0948","Z106","Z106","FOS"]
[null,null,null,null,null,null,null,null,null,null,null,null,null,null,null,null,null,null,null,null,null,null,"1170"," ","1170","FOS"]
[null,null,null,null,null,null,null,null,null,null,null,null,null,null,null,null,null,null,null,null,null,null,"1172"," ","1172","FOS"]
[null,null,null,null,null,null,null,null,null,null,null,null,null,null,null,null,null,null,null,null,null,null,"1173"," ","1173","FOS"]
[null,null,null,null,null,null,null,null,null,null,null,null,null,null,null,null,null,null,null,null,null,null,"1175","Z521","Z521","FOS"]
[null,null,null,null,null,null,null,null,null,null,null,null,null,null,null,null,null,null,null,null,null,null,"1184","1762","1762","FOS"]
[null,null,null,null,null,null,null,null,null,null,null,null,null,null,null,null,null,null,null,null,null,null,"1188"," ","1188","FOS"]
[null,null,null,null,null,null,null,null,null,null,null,null,null,null,null,null,null,null,null,null,null,null,"1193"," ","1193","FOS"]
[null,null,null,null,null,null,null,null,null,null,null,null,null,null,null,null,null,null,null,null,null,null,"0846","0896","0896","BOS"]
[null,null,null,null,null,null,null,null,null,null,null,null,null,null,null,null,null,null,null,null,null,null,"0847","0897","0897","BOS"]
[null,null,null,null,null,null,null,null,null,null,null,null,null,null,null,null,null,null,null,null,null,null,"0848","6091","6091","BOS"]
[null,null,null,null,null,null,null,null,null,null,null,null,null,null,null,null,null,null,null,null,null,null,"0849","0859","0859","BOS"]
[null,null,null,null,null,null,null,null,null,null,null,null,null,null,null,null,null,null,null,null,null,null,"0850","Z416","Z416","BOS"]
[null,null,null,null,null,null,null,null,null,null,null,null,null,null,null,null,null,null,null,null,null,null,"0781","0924","0924","BOS"]
[null,null,null,null,null,null,null,null,null,null,null,null,null,null,null,null,null,null,null,null,null,null,"0782","0927","0927","BOS"]
[null,null,null,null,null,null,null,null,null,null,null,null,null,null,null,null,null,null,null,null,null,null,"0783","1374","1374","BOS"]
[null,null,null,null,null,null,null,null,null,null,null,null,null,null,null,null,null,null,null,null,null,null,"0784","Z173","Z173","BOS"]
[null,null,null,null,null,null,null,null,null,null,null,null,null,null,null,null,null,null,null,null,null,null,"0785","0873","0873","BOS"]
[null,null,null,null,null,null,null,null,null,null,null,null,null,null,null,null,null,null,null,null,null,null,"0786","7058","7058","BOS"]
[null,null,null,null,null,null,null,null,null,null,null,null,null,null,null,null,null,null,null,null,null,null,"0787","0888","0888","BOS"]
[null,null,null,null,null,null,null,null,null,null,null,null,null,null,null,null,null,null,null,null,null,null,"0788","1571","1571","BOS"]
[null,null,null,null,null,null,null,null,null,null,null,null,null,null,null,null,null,null,null,null,null,null,"0790","0869","0869","BOS"]
[null,null,null,null,null,null,null,null,null,null,null,null,null,null,null,null,null,null,null,null,null,null,"0791","3032","3032","BOS"]
[null,null,null,null,null,null,null,null,null,null,null,null,null,null,null,null,null,null,null,null,null,null,"0792","0877","0877","BOS"]
[null,null,null,null,null,null,null,null,null,null,null,null,null,null,null,null,null,null,null,null,null,null,"0794","0887","0887","BOS"]
[null,null,null,null,null,null,null,null,null,null,null,null,null,null,null,null,null,null,null,null,null,null,"0795","0889","0889","BOS"]
[null,null,null,null,null,null,null,null,null,null,null,null,null,null,null,null,null,null,null,null,null,null,"0796","0853","0853T","BOS"]
[null,null,null,null,null,null,null,null,null,null,null,null,null,null,null,null,null,null,null,null,null,null,"0797","0876","0876","BOS"]
[null,null,null,null,null,null,null,null,null,null,null,null,null,null,null,null,null,null,null,null,null,null,"0798","0907","0907","BOS"]
[null,null,null,null,null,null,null,null,null,null,null,null,null,null,null,null,null,null,null,null,null,null,"0800","0857","0857","BOS"]
[null,null,null,null,null,null,null,null,null,null,null,null,null,null,null,null,null,null,null,null,null,null,"0802","Z312","Z312","BOS"]
[null,null,null,null,null,null,null,null,null,null,null,null,null,null,null,null,null,null,null,null,null,null,"0803","0853","0853A","BOS"]
[null,null,null,null,null,null,null,null,null,null,null,null,null,null,null,null,null,null,null,null,null,null,"0804","0854","0854","BOS"]
[null,null,null,null,null,null,null,null,null,null,null,null,null,null,null,null,null,null,null,null,null,null,"0807","Z795","Z795","BOS"]
[null,null,null,null,null,null,null,null,null,null,null,null,null,null,null,null,null,null,null,null,null,null,"0808","0858","0858","BOS"]
[null,null,null,null,null,null,null,null,null,null,null,null,null,null,null,null,null,null,null,null,null,null,"0813","0863","0863","BOS"]
[null,null,null,null,null,null,null,null,null,null,null,null,null,null,null,null,null,null,null,null,null,null,"0814","3039","3039","BOS"]
[null,null,null,null,null,null,null,null,null,null,null,null,null,null,null,null,null,null,null,null,null,null,"0815","Z423","Z423","BOS"]
[null,null,null,null,null,null,null,null,null,null,null,null,null,null,null,null,null,null,null,null,null,null,"0816","0919","0919","BOS"]
[null,null,null,null,null,null,null,null,null,null,null,null,null,null,null,null,null,null,null,null,null,null,"0818","Z204","Z204","BOS"]
[null,null,null,null,null,null,null,null,null,null,null,null,null,null,null,null,null,null,null,null,null,null,"0819","Z713","Z713","BOS"]
[null,null,null,null,null,null,null,null,null,null,null,null,null,null,null,null,null,null,null,null,null,null,"0820","0870","0870","BOS"]
[null,null,null,null,null,null,null,null,null,null,null,null,null,null,null,null,null,null,null,null,null,null,"0821","0856","0856","BOS"]
[null,null,null,null,null,null,null,null,null,null,null,null,null,null,null,null,null,null,null,null,null,null,"0822","Z177","Z177","BOS"]
[null,null,null,null,null,null,null,null,null,null,null,null,null,null,null,null,null,null,null,null,null,null,"0823","5013","5013","BOS"]
[null,null,null,null,null,null,null,null,null,null,null,null,null,null,null,null,null,null,null,null,null,null,"0824","0862","0862","BOS"]
[null,null,null,null,null,null,null,null,null,null,null,null,null,null,null,null,null,null,null,null,null,null,"0826","Z604","Z604","BOS"]
[null,null,null,null,null,null,null,null,null,null,null,null,null,null,null,null,null,null,null,null,null,null,"0827","0864","0864","BOS"]

{"sheet":"DBFH","index":9,"n_rows":42,"n_cols":23,"rows_kept":42,"cut":false,"hidden":true,"merged":[]}
["Duale Berufsausbildung und Fachhochschulreife",null,null,null,null,null,null,null,null,null,null,null,"ASD 2016/17"]
["DBFH"]
[]
["Stundentafel",null,null,null,null,null,"Stundentafel",null,null,null,null,null,null,null,null,null,{"$f":"SUM(Q6:Q29)","v":254},{"$f":"SUM(R6:R29)","v":268},{"$f":"SUM(S6:S29)","v":299},{"$f":"SUM(T6:T29)","v":2290}]
["Kaufmänn.","Ab 1","Ab 2","Ab 3/1","Ab 3/2",null,"Technisch","Ab 1","Ab 2","Ab 3/1","Ab 3/2",null,"KART","SNR","Schule","BERUFSNR","10","11","12","Schüler",null,"Richtung","SNR-FOS"]
["W","18 Blöcke","18 Blöcke","7 Blöcke","VZ",null,"T","18 Blöcke","18 Blöcke","7 Blöcke","VZ",null,"10","1415","Städt. Berufsschule für Bürokommunikation und Industriekaufleute München"," 78511",18,19,22,{"$f":"SUM(Q6:S6)","v":59},{"$f":"VLOOKUP(P6,#REF!,4,FALSE)","v":{"$error":"#REF!"}},{"$f":"IF(ISERR(FIND(\"aufmann\",U6)),\"T\",\"W\")","v":"T"},{"$f":"VLOOKUP(N6,$N$30:$S$40,6,FALSE)","v":"0805"}]
["Religion",2,2,1,0,null,"Religion",2,2,1,0,null,"10","1569","Staatl. Berufsschule I Ingolstadt "," 26708",null,null,12,{"$f":"SUM(Q7:S7)","v":12},{"$f":"VLOOKUP(P7,#REF!,4,FALSE)","v":{"$error":"#REF!"}},"T","0869"]
["Geschichte",0,2,0,2,null,"Geschichte",0,2,0,2,null,"10","1569","Staatl. Berufsschule I Ingolstadt "," 28149",17,16,14,47,{"$f":"VLOOKUP(P8,#REF!,4,FALSE)","v":{"$error":"#REF!"}},"T","0869"]
["Sozialkunde",2,2,2,0,null,"Sozialkunde",2,2,2,0,null,"10","1569","Staatl. Berufsschule I Ingolstadt "," 31612",null,null,14,14,{"$f":"VLOOKUP(P9,#REF!,4,FALSE)","v":{"$error":"#REF!"}},"T","0869"]
["Deutsch",2,2,3,6,null,"Deutsch",2,2,3,6,null,"10","1574","Städt. Berufsschule für Fertigungstechnik München "," 27823",12,12,12,36,{"$f":"VLOOKUP(P10,#REF!,4,FALSE)","v":{"$error":"#REF!"}},"T","0877"]
["Englisch",2,2,4,6,null,"Englisch",2,2,4,6,null,"10","1574","Städt. Berufsschule für Fertigungstechnik München "," 31612",18,18,21,57,{"$f":"VLOOKUP(P11,#REF!,4,FALSE)","v":{"$error":"#REF!"}},"T","0877"]
["Mathematik",2,3,4,6,null,"Mathematik",3,2,3,6,null,"10","1610","Städt. Berufsschule für Finanz- und Immobilienwirtschaft München"," 69101",17,19,15,51,{"$f":"VLOOKUP(P12,#REF!,4,FALSE)","v":{"$error":"#REF!"}},{"$f":"IF(ISERR(FIND(\"aufmann\",U12)),\"T\",\"W\")","v":"T"},"0914"]
["BWR",2,2,6,6,null,"Mathe-Add",0,1,1,3,null,"10","1630","Städt. Berufsschule für Fahrzeugtechnik, Eisenbahn und Fahrbetrieb München"," 28149",18,22,28,68,{"$f":"VLOOKUP(P13,#REF!,4,FALSE)","v":{"$error":"#REF!"}},{"$f":"IF(ISERR(FIND(\"aufmann\",U13)),\"T\",\"W\")","v":"T"},"0877"]
["VWL",1,2,3,2,null,"Physik",2,3,4,6,null,"10","1737","Staatl. Berufsschule Altötting "," 26704",8,6,8,22,{"$f":"VLOOKUP(P14,#REF!,4,FALSE)","v":{"$error":"#REF!"}},"T","0851"]
["NW",1,1,1,2,null,"Chemie",1,1,2,2,null,"10","1737","Staatl. Berufsschule Altötting "," 31330",8,7,7,22,{"$f":"VLOOKUP(P15,#REF!,4,FALSE)","v":{"$error":"#REF!"}},"T","0851"]
["Informatik",0,0,3,3,null,"Informatik",0,2,0,2,null,"10","1737","Staatl. Berufsschule Altötting "," 31612",12,12,5,29,{"$f":"VLOOKUP(P16,#REF!,4,FALSE)","v":{"$error":"#REF!"}},"T","0851"]
["Summe",{"$f":"SUM(B7:B16)","v":14},{"$f":"SUM(C7:C16)","v":18},{"$f":"SUM(D7:D16)","v":27},{"$f":"SUM(E7:E16)","v":33},null,"Summe",{"$f":"SUM(H7:H16)","v":14},{"$f":"SUM(I7:I16)","v":19},{"$f":"SUM(J7:J16)","v":20},{"$f":"SUM(K7:K16)","v":33},null,"10","1741","Städt. Berufsschule für Informationstechnik München"," 77912",1,1,6,8,{"$f":"VLOOKUP(P17,#REF!,4,FALSE)","v":{"$error":"#REF!"}},"T","0914"]
["Fachl. Unt",24,21,11,0,null,"Fachl. Unt",25,19,18,0,null,"10","1741","Städt. Berufsschule für Informationstechnik München"," 77913",18,19,18,55,{"$f":"VLOOKUP(P18,#REF!,4,FALSE)","v":{"$error":"#REF!"}},"T","0914"]
["WU",1,0,1,1,null,"WU",0,1,1,1,null,"10","3025","Hans-Glas-Schule Dingolfing Staatl. Berufsschule "," 26704",19,17,16,52,{"$f":"VLOOKUP(P19,#REF!,4,FALSE)","v":{"$error":"#REF!"}},"T","0874"]
["Gesamt",{"$f":"SUM(B17:B19)","v":39},{"$f":"SUM(C17:C19)","v":39},{"$f":"SUM(D17:D19)","v":39},{"$f":"SUM(E17:E19)","v":34},null,"Gesamt",{"$f":"SUM(H17:H19)","v":39},{"$f":"SUM(I17:I19)","v":39},{"$f":"SUM(J17:J19)","v":39},{"$f":"SUM(K17:K19)","v":34},null,"10","3025","Hans-Glas-Schule Dingolfing Staatl. Berufsschule "," 28149",null,17,17,34,{"$f":"VLOOKUP(P20,#REF!,4,FALSE)","v":{"$error":"#REF!"}},"T","0874"]
[null,null,null,null,null,null,null,null,null,null,null,null,"10","3025","Hans-Glas-Schule Dingolfing Staatl. Berufsschule "," 31334",23,23,23,69,{"$f":"VLOOKUP(P21,#REF!,4,FALSE)","v":{"$error":"#REF!"}},"T","0874"]
["FOS-LK",{"$f":"SUMPRODUCT((B29:B42=\"x\")*(B7:B20))","v":11},{"$f":"SUMPRODUCT((C29:C42=\"x\")*(C7:C20))","v":14},25,34,null,"FOS-LK",{"$f":"SUMPRODUCT((H29:H42=\"x\")*(H7:H20))","v":10},{"$f":"SUMPRODUCT((I29:I42=\"x\")*(I7:I20))","v":16},{"$f":"SUMPRODUCT((J29:J42=\"x\")*(J7:J20))","v":18},34,null,"10","4062","Städt. Berufsschule I für Metall- und Elektrotechnik Regensburg"," 27823",18,12,14,44,{"$f":"VLOOKUP(P22,#REF!,4,FALSE)","v":{"$error":"#REF!"}},"T","0889"]
["Faktor",{"$f":"18/36","v":0.5},{"$f":"18/36","v":0.5},0.25,0.5,null,"Faktor",{"$f":"18/36","v":0.5},{"$f":"18/36","v":0.5},0.25,0.5,null,"10","5017","Lorenz-Kaim-Schule, Staatl. Berufsschule Kronach "," 31612",18,17,17,52,{"$f":"VLOOKUP(P23,#REF!,4,FALSE)","v":{"$error":"#REF!"}},"T","0900"]
["LWS",{"$f":"B23*B22","v":5.5},{"$f":"C23*C22","v":7},{"$f":"D23*D22","v":6.25},{"$f":"E23*E22","v":17},null,"LWS",{"$f":"H23*H22","v":5},{"$f":"I23*I22","v":8},{"$f":"J23*J22","v":4.5},{"$f":"K23*K22","v":17},null,"10","6073","Staatl. Berufsschule Erlangen "," 31330",5,6,4,15,{"$f":"VLOOKUP(P24,#REF!,4,FALSE)","v":{"$error":"#REF!"}},"T","0864"]
[null,null,null,null,null,null,null,null,null,null,null,null,"10","6073","Staatl. Berufsschule Erlangen "," 31338",24,25,26,75,{"$f":"VLOOKUP(P25,#REF!,4,FALSE)","v":{"$error":"#REF!"}},"T","0864"]
["Steuerung, ob von FOS LK",null,null,null,null,null,null,null,null,null,null,null,null,null,null,null,null,null,null,null,null,"T","W"]
["Kaufmänn.","Ab 1","Ab 2","Ab 3/1","Ab 3/2",null,"Technisch","Ab 1","Ab 2","Ab 3/1","Ab 3/2",null,null,null,null,null,null,null,"staatlich",{"$f":"SUMPRODUCT(T30:T40,V30:V40)","v":648},"staatlich",{"$f":"SUMPRODUCT((V30:V40=1)*(W30:W40=\"T\")*(T30:T40))","v":648},{"$f":"SUMPRODUCT((V30:V40=1)*(W30:W40=\"W\")*(T30:T40))","v":0}]
["W","18 Blöcke","18 Blöcke","7 Blöcke","VZ",null,"T","18 Blöcke","18 Blöcke","7 Blöcke","VZ",null,"Nach Schule","BS",null,null,null,null,"FOS",{"$f":"SUM(T30:T40)","v":821},"insgesamt",{"$f":"SUMIF($W$30:$W$40,\"T\",$T$30:$T$40)","v":821},{"$f":"SUMIF($W$30:$W$40,\"W\",$T$30:$T$40)","v":0}]
["Religion",null,null,null,"x",null,"Religion",null,null,null,"x",null,"KART","SNR","Schule","10","11","12","SNR","Schüler"]
["Geschichte","x","x","x","x",null,"Geschichte","x","x","x","x",null,"10","1415","Städt. Berufsschule für Bürokommunikation und Industriekaufleute München",18,19,22,"0805",{"$f":"SUM(P30:R30)","v":59},{"$f":"IF(V30=1,VLOOKUP(S30,Schuldatei!$L$5:$M$71,2,FALSE),\"nichtstaatlich\")","v":"nichtstaatlich"},{"$f":"COUNTIF(Schuldatei!$L$5:$M$71,S30)","v":0},{"$f":"INDEX($V$6:$V$25,MATCH(S30,$W$6:$W$25,0))","v":"T"}]
["Sozialkunde",null,null,null,"x",null,"Sozialkunde",null,null,null,"x",null,"10","1569","Staatl. Berufsschule I Ingolstadt ",17,16,40,"0869",{"$f":"SUM(P31:R31)","v":73},{"$f":"IF(V31=1,VLOOKUP(S31,Schuldatei!$L$5:$M$71,2,FALSE),\"nichtstaatlich\")","v":"Staatliche Fachoberschule Ingolstadt "},{"$f":"COUNTIF(Schuldatei!$L$5:$M$71,S31)","v":1},{"$f":"INDEX($V$6:$V$25,MATCH(S31,$W$6:$W$25,0))","v":"T"}]
["Deutsch","x","x","x","x",null,"Deutsch","x","x","x","x",null,"10","1574","Städt. Berufsschule für Fertigungstechnik München ",30,30,33,"0877",93,{"$f":"IF(V32=1,VLOOKUP(S32,Schuldatei!$L$5:$M$71,2,FALSE),\"nichtstaatlich\")","v":"Staatliche Fachoberschule für Technik München "},{"$f":"COUNTIF(Schuldatei!$L$5:$M$71,S32)","v":1},"T"]
["Englisch","x","x","x","x",null,"Englisch","x","x","x","x",null,"10","1610","Städt. Berufsschule für Finanz- und Immobilienwirtschaft München",17,19,15,"0914",51,{"$f":"IF(V33=1,VLOOKUP(S33,Schuldatei!$L$5:$M$71,2,FALSE),\"nichtstaatlich\")","v":"nichtstaatlich"},{"$f":"COUNTIF(Schuldatei!$L$5:$M$71,S33)","v":0},"T"]
["Mathematik","x","x","x","x",null,"Mathematik","x","x","x","x",null,"10","1630","Städt. Berufsschule für Fahrzeugtechnik, Eisenbahn und Fahrbetrieb München",18,22,28,"0877",68,{"$f":"IF(V34=1,VLOOKUP(S34,Schuldatei!$L$5:$M$71,2,FALSE),\"nichtstaatlich\")","v":"Staatliche Fachoberschule für Technik München "},{"$f":"COUNTIF(Schuldatei!$L$5:$M$71,S34)","v":1},"T"]
["BWR","x","x","x","x",null,"BWR","x","x","x","x",null,"10","1737","Staatl. Berufsschule Altötting ",28,25,20,"0851",73,{"$f":"IF(V35=1,VLOOKUP(S35,Schuldatei!$L$5:$M$71,2,FALSE),\"nichtstaatlich\")","v":"Staatl. Fachoberschule Altötting "},{"$f":"COUNTIF(Schuldatei!$L$5:$M$71,S35)","v":1},"T"]
["VWL","x","x","x","x",null,"VWL","x","x","x","x",null,"10","1741","Städt. Berufsschule für Informationstechnik München",19,20,24,"0914",63,{"$f":"IF(V36=1,VLOOKUP(S36,Schuldatei!$L$5:$M$71,2,FALSE),\"nichtstaatlich\")","v":"nichtstaatlich"},{"$f":"COUNTIF(Schuldatei!$L$5:$M$71,S36)","v":0},"T"]
["NW","x","x","x","x",null,"NW","x","x","x","x",null,"10","3025","Hans-Glas-Schule Dingolfing Staatl. Berufsschule ",42,57,56,"0874",155,{"$f":"IF(V37=1,VLOOKUP(S37,Schuldatei!$L$5:$M$71,2,FALSE),\"nichtstaatlich\")","v":"Staatliche Fachoberschule Landshut "},{"$f":"COUNTIF(Schuldatei!$L$5:$M$71,S37)","v":1},"T"]
["Informatik","x","x","x","x",null,"Informatik","x","x","x","x",null,"10","4062","Städt. Berufsschule I für Metall- und Elektrotechnik Regensburg",18,12,14,"0889",44,{"$f":"IF(V38=1,VLOOKUP(S38,Schuldatei!$L$5:$M$71,2,FALSE),\"nichtstaatlich\")","v":"Staatliche Fachoberschule Regensburg "},{"$f":"COUNTIF(Schuldatei!$L$5:$M$71,S38)","v":1},"T"]
["Summe",{"$f":"SUM(B29:B38)","v":0},{"$f":"SUM(C29:C38)","v":0},{"$f":"SUM(D29:D38)","v":0},{"$f":"SUM(E29:E38)","v":0},null,"Summe",{"$f":"SUM(H29:H38)","v":0},{"$f":"SUM(I29:I38)","v":0},{"$f":"SUM(J29:J38)","v":0},{"$f":"SUM(K29:K38)","v":0},null,"10","5017","Lorenz-Kaim-Schule, Staatl. Berufsschule Kronach ",18,17,17,"0900",52,{"$f":"IF(V39=1,VLOOKUP(S39,Schuldatei!$L$5:$M$71,2,FALSE),\"nichtstaatlich\")","v":"Adalbert-Raps-Schule Staatl. Fachoberschule Kulmbach"},{"$f":"COUNTIF(Schuldatei!$L$5:$M$71,S39)","v":1},"T"]
["Fachl. Unt",null,null,null,null,null,"Fachl. Unt",null,null,null,null,null,"10","6073","Staatl. Berufsschule Erlangen ",29,31,30,"0864",90,{"$f":"IF(V40=1,VLOOKUP(S40,Schuldatei!$L$5:$M$71,2,FALSE),\"nichtstaatlich\")","v":"Staatliche Fachoberschule Erlangen "},{"$f":"COUNTIF(Schuldatei!$L$5:$M$71,S40)","v":1},"T"]
["WU","x","x","x","x",null,"WU","x","x","x","x"]
["Gesamt",{"$f":"SUM(B39:B41)","v":0},{"$f":"SUM(C39:C41)","v":0},{"$f":"SUM(D39:D41)","v":0},{"$f":"SUM(E39:E41)","v":0},null,"Gesamt",{"$f":"SUM(H39:H41)","v":0},{"$f":"SUM(I39:I41)","v":0},{"$f":"SUM(J39:J41)","v":0},{"$f":"SUM(K39:K41)","v":0}]